3-(4-Methoxyphenyl)propionic acid
- Formula: C10H12O3
- Molecular weight: 180.2005
- IUPAC Standard InChIKey: FIUFLISGGHNPSM-UHFFFAOYSA-N
- CAS Registry Number: 1929-29-9
- Chemical structure:
View 3d structure (requires JavaScript / HTML 5) - Other names: 3-(4-Methoxyphenyl)propanoic acid; p-Methoxyhydrocinnamic acid; Benzenepropanoic acid, 4-methoxy-; 3-(p-Methoxyphenyl)propionic acid; NSC 51509; Hydrocinnamic acid, p-methoxy-; 4-Methoxybenzenepropanoic acid

Phase change data

Data compiled by: William E. Acree, Jr., James S. Chickos
Quantity | Value | Units | Method | Reference | Comment |
---|---|---|---|---|---|
ΔsubH° | 29.76 ± 0.41 | kcal/mol | ME | Monte and Hillesheim, 2001 | Based on data from 341. to 357. K. |
Enthalpy of sublimation
ΔsubH (kcal/mol) | Temperature (K) | Method | Reference | Comment |
---|---|---|---|---|
29.23 ± 0.07 | 349. | ME | Monte and Hillesheim, 2001 | Based on data from 341. to 357. K. |
Enthalpy of fusion
ΔfusH (kcal/mol) | Temperature (K) | Method | Reference |
---|---|---|---|
7.067 | 376.1 | DSC | Monte and Hillesheim, 2001 |
6.81 | 376.9 | N/A | Acree, 1991 |

References

Monte and Hillesheim, 2001
Monte, Manuel J.S.; Hillesheim, Dorothea M.,
Thermodynamic study on the sublimation of 3-phenylpropionic acid and of three methoxy-substituted 3-phenylpropionic acids,
The Journal of Chemical Thermodynamics, 2001, 33, 8, 837-847, https://doi.org/10.1006/jcht.2000.0767
. [all data]
Acree, 1991
Acree, William E.,
Thermodynamic properties of organic compounds: enthalpy of fusion and melting point temperature compilation,
Thermochimica Acta, 1991, 189, 1, 37-56, https://doi.org/10.1016/0040-6031(91)87098-H
. [all data]