Diborane
- Formula: B2H6
- Molecular weight: 27.670
- IUPAC Standard InChIKey: GCXMMZWJUYHRTG-UHFFFAOYSA-N
- CAS Registry Number: 19287-45-7
- Chemical structure:

Gas phase thermochemistry data

Quantity | Value | Units | Method | Reference | Comment |
---|---|---|---|---|---|
ΔfH°gas | 41.00 | kJ/mol | Review | Chase, 1998 | Data last reviewed in December, 1964 |
Quantity | Value | Units | Method | Reference | Comment |
S°gas,1 bar | 233.17 | J/mol*K | Review | Chase, 1998 | Data last reviewed in December, 1964 |
Gas Phase Heat Capacity (Shomate Equation)
Cp° = A + B*t + C*t2 + D*t3 +
E/t2
H° − H°298.15= A*t + B*t2/2 +
C*t3/3 + D*t4/4 − E/t + F − H
S° = A*ln(t) + B*t + C*t2/2 + D*t3/3 −
E/(2*t2) + G
Cp = heat capacity (J/mol*K)
H° = standard enthalpy (kJ/mol)
S° = standard entropy (J/mol*K)
t = temperature (K) / 1000.
View plot Requires a JavaScript / HTML 5 canvas capable browser.
Temperature (K) | 298. to 1200. | 1200. to 6000. |
---|---|---|
A | -12.42167 | 161.6275 |
B | 267.6112 | 11.23329 |
C | -152.2612 | -2.178187 |
D | 33.15879 | 0.146029 |
E | 0.300489 | -36.76757 |
F | 35.09886 | -89.40873 |
G | 146.5115 | 320.5023 |
H | 41.00303 | 41.00303 |
Reference | Chase, 1998 | Chase, 1998 |
Comment | Data last reviewed in December, 1964 | Data last reviewed in December, 1964 |

Phase change data

Data compiled as indicated in comments:
AC - William E. Acree, Jr., James S. Chickos
Enthalpy of vaporization
ΔvapH (kJ/mol) | Temperature (K) | Method | Reference | Comment |
---|---|---|---|---|
15.3 | 164. | N/A | Ditter, Perrine, et al., 1961 | Based on data from 118. to 179. K.; AC |
14.2 | 180. | C | Paridon, MacWood, et al., 1959 | AC |
12.6 | 210. | C | Paridon, MacWood, et al., 1959 | AC |
10.5 | 240. | C | Paridon, MacWood, et al., 1959 | AC |
7.3 | 270. | C | Paridon, MacWood, et al., 1959 | AC |
Antoine Equation Parameters
log10(P) = A − (B / (T + C))
P = vapor pressure (bar)
T = temperature (K)
View plot Requires a JavaScript / HTML 5 canvas capable browser.
Temperature (K) | A | B | C | Reference | Comment |
---|---|---|---|---|---|
118.3 to 180.8 | 3.78156 | 598.39 | -22.175 | Ditter, Perrine, et al., 1961, 2 | Coefficents calculated by NIST from author's data. |

Ion clustering data

Data compiled by: John E. Bartmess
Clustering reactions
By formula: H- + H6B2 = (H- • H6B2)
Quantity | Value | Units | Method | Reference | Comment |
---|---|---|---|---|---|
ΔrH° | 309.6 | kJ/mol | Ther | Workman and Squires, 1988 | gas phase; Calculated from data on BH3..BH4- |

Reaction thermochemistry data

Data compiled by: John E. Bartmess
Individual Reactions
By formula: H- + H6B2 = (H- • H6B2)
Quantity | Value | Units | Method | Reference | Comment |
---|---|---|---|---|---|
ΔrH° | 309.6 | kJ/mol | Ther | Workman and Squires, 1988 | gas phase; Calculated from data on BH3..BH4- |

Gas phase ion energetics data

Data evaluated as indicated in comments:
HL - Edward P. Hunter and Sharon G. Lias
L - Sharon G. Lias
Data compiled as indicated in comments:
LL - Sharon G. Lias and Joel F. Liebman
LLK - Sharon G. Lias, Rhoda D. Levin, and Sherif A. Kafafi
RDSH - Henry M. Rosenstock, Keith Draxl, Bruce W. Steiner, and John T. Herron
Quantity | Value | Units | Method | Reference | Comment |
---|---|---|---|---|---|
IE (evaluated) | 11.38 ± 0.05 | eV | N/A | N/A | L |
Quantity | Value | Units | Method | Reference | Comment |
Proton affinity (review) | 147. | kcal/mol | N/A | Hunter and Lias, 1998 | HL |
Quantity | Value | Units | Method | Reference | Comment |
Gas basicity | 140.1 | kcal/mol | N/A | Hunter and Lias, 1998 | HL |
Ionization energy determinations
IE (eV) | Method | Reference | Comment |
---|---|---|---|
≤11.37 ± 0.05 | PI | Ruscic, Mayhew, et al., 1988 | LL |
11.4 | PE | Asbrink, Svensson, et al., 1981 | LLK |
11.41 ± 0.02 | PE | Lloyd and Lynaugh, 1970 | RDSH |
11.38 ± 0.01 | PE | Brundle, Robin, et al., 1970 | RDSH |
20.2 ± 0.1 | PE | Brundle, Robin, et al., 1970 | RDSH |
11.37 ± 0.01 | PE | Rose, Frey, et al., ibid. | RDSH |
11.9 | PE | Asbrink, Svensson, et al., 1981 | Vertical value; LLK |
Appearance energy determinations

References

Chase, 1998
Chase, M.W., Jr.,
NIST-JANAF Themochemical Tables, Fourth Edition,
J. Phys. Chem. Ref. Data, Monograph 9, 1998, 1-1951. [all data]
Ditter, Perrine, et al., 1961
Ditter, J.F.; Perrine, J.C.; Shapiro, Isadore,
Vapor Pressure of Deuterodiborane.,
J. Chem. Eng. Data, 1961, 6, 2, 271-271, https://doi.org/10.1021/je60010a026
. [all data]
Paridon, MacWood, et al., 1959
Paridon, Leo J.; MacWood, George E.; Hu, Jih-Heng,
The Heat of Vaporization of Diborane,
J. Phys. Chem., 1959, 63, 12, 1998-1999, https://doi.org/10.1021/j150582a004
. [all data]
Ditter, Perrine, et al., 1961, 2
Ditter, J.F.; Perrine, J.C.; Shapiro, I.,
Vapor Pressure of Deuterodiborane,
J. Chem. Eng. Data, 1961, 6, 2, 271, https://doi.org/10.1021/je60010a026
. [all data]
Workman and Squires, 1988
Workman, D.B.; Squires, R.R.,
Hydride Binding Energies of Boranes,
Inorg. Chem., 1988, 27, 11, 1846, https://doi.org/10.1021/ic00284a003
. [all data]