2,4-D methyl ester
- Formula: C9H8Cl2O3
- Molecular weight: 235.064
- IUPAC Standard InChIKey: HWIGZMADSFQMOI-UHFFFAOYSA-N
- CAS Registry Number: 1928-38-7
- Chemical structure:
View 3d structure (requires JavaScript / HTML 5) - Other names: Acetic acid, (2,4-dichlorophenoxy)-, methyl ester; (2,4-Dichlorophenoxy)acetic acid, methyl ester; Methyl (2,4-dichlorophenoxy)acetate; Methyl 2,4-D ester; Methyl ester of 2,4-Dichlorophenoxyacetic acid; Acetic acid, (2,4-dichlorophenoxy)-, methylated; D (2,4-) methylester

Phase change data

Data compiled as indicated in comments:
TRC - Thermodynamics Research Center, NIST Boulder Laboratories, Chris Muzny director
AC - William E. Acree, Jr., James S. Chickos
Quantity | Value | Units | Method | Reference | Comment |
---|---|---|---|---|---|
Tfus | 315.4 | K | N/A | Plato and Glasgow, 1969 | Uncertainty assigned by TRC = 0.2 K; TRC |
Enthalpy of vaporization
ΔvapH (kJ/mol) | Temperature (K) | Method | Reference | Comment |
---|---|---|---|---|
68.0 | 418. | A | Stephenson and Malanowski, 1987 | Based on data from 403. to 548. K. See also Dykyj, Svoboda, et al., 1999.; AC |
Enthalpy of fusion
ΔfusH (kJ/mol) | Temperature (K) | Method | Reference | Comment |
---|---|---|---|---|
20.0 | 313.4 | DSC | Vecchio and Brunetti, 2005 | AC |
25.1 | 315.4 | DSC | Plato and Glasgow, 1969, 2 | AC |

Kovats' RI, non-polar column, isothermal

View large format table.

Column type Active phase Temperature (C) I Reference Comment
CapillaryOV-1160.1590.Erdmann, Rochholz, et al., 1992
CapillaryOV-1190.1606.Erdmann, Rochholz, et al., 1992
PackedDC-200165.1591.de Beer, van Peteghem, et al., 1978
PackedDC-200165.1593.de Beer, van Peteghem, et al., 1978

Kovats' RI, non-polar column, custom temperature program

View large format table.

Column type Active phase I Reference Comment
PackedSE-301605.Ramsey, Lee, et al., 1980He, Chromosorb G HP (80-100 mesh); Column length: 1.5 m; Program: not specified

Kovats' RI, polar column, isothermal

View large format table.

Column type Active phase Temperature (C) I Reference Comment
PackedFFAP165.2395.de Beer, van Peteghem, et al., 1978Column length: 1.8 m
PackedFFAP165.2396.de Beer, van Peteghem, et al., 1978Column length: 1.8 m

Normal alkane RI, non-polar column, temperature ramp

View large format table.

Column type Active phase I Reference Comment
CapillaryUltra-11581.Okumura, 199125. m/0.32 mm/0.25 μm, He, 3. K/min; Tstart: 80. C; Tend: 260. C

Normal alkane RI, non-polar column, custom temperature program

View large format table.

Column type Active phase I Reference Comment
CapillaryOV-1, SE-30, Methyl silicone, SP-2100, OV-101, DB-1, etc.1605.Waggott and Davies, 1984Hydrogen; Column length: 50. m; Column diameter: 0.32 mm; Program: not specified
OtherMethyl Silicone1605.Ardrey and Moffat, 1981Program: not specified

Normal alkane RI, polar column, custom temperature program

View large format table.

Column type Active phase I Reference Comment
CapillarySuperox 0.6; Carbowax 20M2465.Waggott and Davies, 1984Hydrogen; Column length: 50. m; Column diameter: 0.32 mm; Program: not specified
CapillaryCarbowax 400, Carbowax 20M, Carbowax 1540, Carbowax 4000, Superox 06, PEG 20M, etc.2465.Waggott and Davies, 1984Hydrogen; Column length: 50. m; Column diameter: 0.32 mm; Program: not specified

References

Plato and Glasgow, 1969
Plato, C.; Glasgow, A.R., Jr.,
Differential scanning calorimetry as a general method for determining the purity and heat of fusion of high-purity organic chemicals. Application to 95 compounds,
Anal. Chem., 1969, 41, 2, 330, https://doi.org/10.1021/ac60271a041
. [all data]
Stephenson and Malanowski, 1987
Stephenson, Richard M.; Malanowski, Stanislaw,
Handbook of the Thermodynamics of Organic Compounds, 1987, https://doi.org/10.1007/978-94-009-3173-2
. [all data]
Dykyj, Svoboda, et al., 1999
Dykyj, J.; Svoboda, J.; Wilhoit, R.C.; Frenkel, M.L.; Hall, K.R.,
Vapor Pressure of Chemicals: Part A. Vapor Pressure and Antoine Constants for Hydrocarbons and Sulfur, Selenium, Tellurium and Hydrogen Containing Organic Compounds, Springer, Berlin, 1999, 373. [all data]
Vecchio and Brunetti, 2005
Vecchio, Stefano; Brunetti, Bruno,
Standard Sublimation Enthalpies of Some Dichlorophenoxy Acids and Their Methyl Esters,
J. Chem. Eng. Data, 2005, 50, 2, 666-672, https://doi.org/10.1021/je049626l
. [all data]
Plato and Glasgow, 1969, 2
Plato, Candace.; Glasgow, Augustus R.,
Differential scanning calorimetry as a general method for determining the purity and heat of fusion of high-purity organic chemicals. Application to 95 compounds,
Anal. Chem., 1969, 41, 2, 330-336, https://doi.org/10.1021/ac60271a041
. [all data]