3,3-dimethyl-1-pentanol
- Formula: C7H16O
- Molecular weight: 116.2013
- IUPAC Standard InChIKey: IFDHMBHPLKHMOY-UHFFFAOYSA-N
- CAS Registry Number: 19264-94-9
- Chemical structure:
View 3d structure (requires JavaScript / HTML 5) - Permanent link for this species. Use this link for bookmarking this species for future reference.

Phase change data

Data compiled by: Thermodynamics Research Center, NIST Boulder Laboratories, Chris Muzny director
Quantity | Value | Units | Method | Reference | Comment |
---|---|---|---|---|---|
Tboil | 440.15 | K | N/A | Birch, 1949 | Uncertainty assigned by TRC = 3. K |

References

Birch, 1949
Birch, A.J.,
J. Chem. Soc., 1949, 1949, 2721. [all data]