Benzene, (1,2,2-trimethylpropyl)-
- Formula: C12H18
- Molecular weight: 162.2713
- IUPAC Standard InChIKey: UYOAOYYUSXVILM-UHFFFAOYSA-N
- CAS Registry Number: 19262-20-5
- Chemical structure:
View 3d structure (requires JavaScript / HTML 5) - Other names: (1,2,2-Trimethylpropyl)benzene; 2-Phenyl-3,3-dimethylbutane

Kovats' RI, polar column, isothermal

Column type | Active phase | Temperature (C) | I | Reference | Comment |
---|---|---|---|---|---|
Capillary | Carbowax 20M | 90. | 1259.4 | Döring, Estel, et al., 1974 | Column length: 100. m; Column diameter: 0.2 mm |

References

Döring, Estel, et al., 1974
Döring, C.E.; Estel, D.; Fischer, R.,
Kapillar-gaschromatographische Charakterisierung von C10-bis C12-Aromaten,
J. Prakt. Chem., 1974, 316, 1, 1-12, https://doi.org/10.1002/prac.19743160102
. [all data]