tetraiodothiophene
- Formula: C4I4S
- Molecular weight: 587.726
- IUPAC Standard InChIKey: VWDOXSASHQWCRB-UHFFFAOYSA-N
- CAS Registry Number: 19259-11-1
- Chemical structure:
View 3d structure (requires JavaScript / HTML 5) - Permanent link for this species. Use this link for bookmarking this species for future reference.

Phase change data

Antoine Equation Parameters
log10(P) = A − (B / (T + C))
P = vapor pressure (bar)
T = temperature (K)
View plot Requires a JavaScript / HTML 5 canvas capable browser.
Temperature (K) | A | B | C | Reference | Comment |
---|---|---|---|---|---|
208.32 to 296.72 | 3.36567 | 1138.633 | -70.393 | Milazzo, 1956 | Coefficents calculated by NIST from author's data. |

Gas phase ion energetics data

Data compiled as indicated in comments:
LLK - Sharon G. Lias, Rhoda D. Levin, and Sherif A. Kafafi
Ionization energy determinations
IE (eV) | Method | Reference | Comment |
---|---|---|---|
8.27 | PE | Bozic, Humski, et al., 1977 | Vertical value; LLK |

References

Milazzo, 1956
Milazzo, G.,
Tensioni di Vapore di Alcune Sostanze Organiche a Bassa Temperatura,
Ann. Chim. (Rome), 1956, 46, 1105-1111. [all data]