C9H11F3Si
- Formula: C9H11F3Si
- Molecular weight: 204.2643
- CAS Registry Number: 19254-78-5

Gas phase ion energetics data

Data compiled by: John E. Bartmess
De-protonation reactions
C9H10F3Si- + = C9H11F3Si
By formula: C9H10F3Si- + H+ = C9H11F3Si
Quantity | Value | Units | Method | Reference | Comment |
---|---|---|---|---|---|
ΔrH° | 1574. ± 9.2 | kJ/mol | G+TS | Irie, Kikukawa, et al., 2001 | gas phase; The anion may be ArSiH(Me)CH2-, based on LFER size and ab initio calculations - JEB |
Quantity | Value | Units | Method | Reference | Comment |
ΔrG° | 1541. ± 8.4 | kJ/mol | IMRE | Irie, Kikukawa, et al., 2001 | gas phase; The anion may be ArSiH(Me)CH2-, based on LFER size and ab initio calculations - JEB |

References

Irie, Kikukawa, et al., 2001
Irie, M.; Kikukawa, K.; Shimizu, N.; Mishima, M.,
Gas-phase acidities of aryldimethylsilanes,
J. Chem. Soc. Perkin Trans., 2001, 2, 6, 923-928, https://doi.org/10.1039/b100488n
. [all data]