(S)-(+)-2-Chloro-1-propanol
- Formula: C3H7ClO
- Molecular weight: 94.540
- IUPAC Standard InChIKey: VZIQXGLTRZLBEX-GSVOUGTGSA-N
- CAS Registry Number: 19210-21-0
- Chemical structure:
View 3d structure (requires JavaScript / HTML 5) - Stereoisomers:
- Other names: (S)-(+)-2-Chloropropan-1-ol

Phase change data

Data compiled by: Robert L. Brown and Stephen E. Stein
Reduced pressure boiling point
Tboil (K) | Pressure (atm) | Reference |
---|---|---|
343.5 | 0.099 | Aldrich Chemical Company Inc., 1990 |

References

Aldrich Chemical Company Inc., 1990
Aldrich Chemical Company Inc.,
Catalog Handbook of Fine Chemicals, Aldrich Chemical Company, Inc., Milwaukee WI, 1990, 1. [all data]