2H-Pyran-2-carboxaldehyde, 3,4-dihydro-2,5-dimethyl-
- Formula: C8H12O2
- Molecular weight: 140.1797
- IUPAC Standard InChIKey: DYVJZCIYRQUXBA-UHFFFAOYSA-N
- CAS Registry Number: 1920-21-4
- Chemical structure:
View 3d structure (requires JavaScript / HTML 5) - Other names: Methacrolein dimer; Methacrylaldehyde dimer; 1,4-Pyran, 2,3-dihydro-2,5-dimethyl-2-formyl-; 2,3-Dihydro-2,5-dimethyl-2-formyl-1,4-pyran; 2,3-Dihydro-2,5-dimethyl-2H-pyran-2-carboxaldehyde; 2H-Pyran-2-carboxaldehyde, 3,4-dihydro-2,5-dimethylmethacrolein dimer; 3,4-dihydro-2,5-dimethyl-2H-pyran-2-carbaldehyde

Phase change data

Data compiled by: Thermodynamics Research Center, NIST Boulder Laboratories, Chris Muzny director
Quantity | Value | Units | Method | Reference | Comment |
---|---|---|---|---|---|
Tfus | 209. | K | N/A | Anonymous, 1954 | Uncertainty assigned by TRC = 0.6 K |

References

Anonymous, 1954
Anonymous, R.,
, Am. Pet. Inst. Res. Proj. 45, Tech. Rep. 13, Ohio State Univ., 1954. [all data]