Dicamba
- Formula: C8H6Cl2O3
- Molecular weight: 221.037
- IUPAC Standard InChIKey: IWEDIXLBFLAXBO-UHFFFAOYSA-N
- CAS Registry Number: 1918-00-9
- Chemical structure:
View 3d structure (requires JavaScript / HTML 5) - Other names: Benzoic acid, 3,6-dichloro-2-methoxy-; o-Anisic acid, 3,6-dichloro-; Dianat; Mediben; Velsicol Compound "R"; Velsicol 58-CS-11; 2-Methoxy-3,6-dichlorobenzoic acid; 2,5-Dichloro-6-methoxybenzoic acid; 3,6-Dichloro-o-anisic acid; 3,6-Dichloro-2-methoxybenzoic acid; Acido (3,6-dicloro-2-metossi)-benzoico; Banlen; Banvel; Banvel CST; Banvel herbicide; Banvel II herbicide; Brush buster; Compound B dicamba; Dianate; 3,6-Dichloor-2-methoxy-benzoeizuur; 3,6-Dichlor-3-methoxy-benzoesaeure; Kyselina 3,6-dichlor-2-methoxybenzoova; MDBA; Banvel 480; Banvel 70WP; Banvel SGF; Vanquish; Velsicol compound R

Phase change data

Data compiled as indicated in comments:
TRC - Thermodynamics Research Center, NIST Boulder Laboratories, Chris Muzny director
AC - William E. Acree, Jr., James S. Chickos
Quantity | Value | Units | Method | Reference | Comment |
---|---|---|---|---|---|
Tfus | 387.23 | K | N/A | Donnelly, Drewes, et al., 1990 | Uncertainty assigned by TRC = 0.2 K; TRC |
Tfus | 386.5 | K | N/A | Plato and Glasgow, 1969 | Uncertainty assigned by TRC = 0.1 K; TRC |
Enthalpy of fusion
ΔfusH (kJ/mol) | Temperature (K) | Method | Reference | Comment |
---|---|---|---|---|
22.9 | 386.7 | DSC | Acree, 1991 | See also Donnelly, Drewes, et al., 1990, 2.; AC |

Normal alkane RI, non-polar column, temperature ramp

Column type | Active phase | I | Reference | Comment |
---|---|---|---|---|
Capillary | Ultra-1 | 1617. | Okumura, 1991 | 25. m/0.32 mm/0.25 μm, He, 3. K/min; Tstart: 80. C; Tend: 260. C |

References

Donnelly, Drewes, et al., 1990
Donnelly, J.R.; Drewes, L.A.; Johnson, R.L.; Munslow, W.D.; Knapp, K.K.; Sovocool, G.W.,
Purity and heat of fusion data for environmental standards as determined by differential scanning calorimetry,
Thermochim. Acta, 1990, 167, 2, 155, https://doi.org/10.1016/0040-6031(90)80476-F
. [all data]
Plato and Glasgow, 1969
Plato, C.; Glasgow, A.R., Jr.,
Differential scanning calorimetry as a general method for determining the purity and heat of fusion of high-purity organic chemicals. Application to 95 compounds,
Anal. Chem., 1969, 41, 2, 330, https://doi.org/10.1021/ac60271a041
. [all data]
Acree, 1991
Acree, William E.,
Thermodynamic properties of organic compounds: enthalpy of fusion and melting point temperature compilation,
Thermochimica Acta, 1991, 189, 1, 37-56, https://doi.org/10.1016/0040-6031(91)87098-H
. [all data]
Donnelly, Drewes, et al., 1990, 2
Donnelly, J.R.; Drewes, L.A.; Johnson, R.L.; Munslow, W.D.; Knapp, K.K.; Sovocool, G.W.,
Purity and heat of fusion data for environmental standards as determined by differential scanning calorimetry,
Thermochimica Acta, 1990, 167, 2, 155-187, https://doi.org/10.1016/0040-6031(90)80476-F
. [all data]