Chromate(-1), dicarbonyl(η5-2,4-cyclopentadien-1-yl)-

Reaction thermochemistry data

Data compiled by: John E. Bartmess

Individual Reactions

C7H5CrO2- + Carbon monoxide = C8H5CrO3-

By formula: C7H5CrO2- + CO = C8H5CrO3-

Quantity Value Units Method Reference Comment
Δr8.70 ± 0.80kcal/molN/ASunderlin and Squires, 1999gas phase

Ion clustering data

Data compiled by: John E. Bartmess

Clustering reactions

C7H5CrO2- + Carbon monoxide = C8H5CrO3-

By formula: C7H5CrO2- + CO = C8H5CrO3-

Quantity Value Units Method Reference Comment
Δr8.70 ± 0.80kcal/molN/ASunderlin and Squires, 1999gas phase

References

Sunderlin and Squires, 1999
Sunderlin, L.S.; Squires, R.R., Bond strengths in cyclopentadienyl metal carbonyl anions, Int. J. Mass Spectrom., 1999, 183, 149-161, https://doi.org/10.1016/S1387-3806(98)14230-6 . [all data]