2-Tridecene
- Formula: C13H26
- Molecular weight: 182.3455
- IUPAC Standard InChIKey: XWVHBWQEYOROBE-UHFFFAOYSA-N
- CAS Registry Number: 19150-20-0
- Chemical structure:
View 3d structure (requires JavaScript / HTML 5) - Stereoisomers:

Van Den Dool and Kratz RI, non-polar column, temperature ramp

Column type | Active phase | I | Reference | Comment |
---|---|---|---|---|
Capillary | HP-5 | 1296. | Flamini, Cioni, et al., 2002 | 30. m/0.25 mm/0.25 μm, N2, 60. C @ 10. min, 5. K/min; Tend: 220. C |

Normal alkane RI, non-polar column, custom temperature program

Column type | Active phase | I | Reference | Comment |
---|---|---|---|---|
Capillary | DB-1 | 1318. | Touafek, Nacer, et al., 2004 | 30. m/0.25 mm/0.25 μm, He; Program: 45C => 3C/min => 175C => 15C/min => 300C (15min) |

Lee's RI, non-polar column, custom temperature program

Column type | Active phase | I | Reference | Comment |
---|---|---|---|---|
Capillary | DB-5 | 220.2 | Fuentes, Font, et al., 2007 | Column length: 60. m; Program: not specified |

References

Flamini, Cioni, et al., 2002
Flamini, G.; Cioni, P.L.; Morelli, I.,
Differences in the fragrances of pollen and different floral parts of male and female flowers of Laurus nobilis,
J. Agric. Food Chem., 2002, 50, 16, 4647-4652, https://doi.org/10.1021/jf020269x
. [all data]
Touafek, Nacer, et al., 2004
Touafek, O.; Nacer, A.; Kabouce, A.; Kabouche, Z.; Bruneau, C.,
Chemical composition of the essential oil of Rosmarinus officinalis cultivated in the Algerian sahara,
Chem. Nat. Compd. (Engl. Transl.), 2004, 40, 1, 28-29, https://doi.org/10.1023/B:CONC.0000025460.78222.69
. [all data]
Fuentes, Font, et al., 2007
Fuentes, M.J.; Font, R.; Gomez-Rico, M.F.; Martin-Gullon, I.,
Pyrolysis and combustion of waste lubricant oil from diesel cars: Decomposition and pollutants,
J. Anal. Appl. Pyrolysis, 2007, 79, 1-2, 215-226, https://doi.org/10.1016/j.jaap.2006.12.004
. [all data]