Trisulfide, bis(2-chloroethyl)-
- Formula: C4H8Cl2S3
- Molecular weight: 223.207
- IUPAC Standard InChIKey: XHODIRQQNWHUGV-UHFFFAOYSA-N
- CAS Registry Number: 19149-77-0
- Chemical structure:
View 3d structure (requires JavaScript / HTML 5) - Species with the same structure:
- Other names: Trisulfane, 1,3-di(2-chloroethyl)-; 1,3-Bis(2-chloroethyl)trisulfane; bis-(2-Chloroethyl) trisulfide

Phase change data

Data compiled by: William E. Acree, Jr., James S. Chickos
Enthalpy of vaporization
ΔvapH (kJ/mol) | Temperature (K) | Method | Reference | Comment |
---|---|---|---|---|
68.2 | 308. | A,GS | Stephenson and Malanowski, 1987 | Based on data from 293. to 333. K. See also Redemann, Chaikin, et al., 1948 and Dykyj, Svoboda, et al., 1999. |

Van Den Dool and Kratz RI, non-polar column, temperature ramp

Column type | Active phase | I | Reference | Comment |
---|---|---|---|---|
Capillary | OV-1 | 1562. | Kostiainen, 2000 | 15. m/0.32 mm/0.25 μm, He, 50. C @ 2. min, 10. K/min, 280. C @ 10. min |
Capillary | SE-54 | 1626.3 | Kostiainen, 2000 | 25. m/0.32 mm/0.25 μm, He, 40. C @ 1. min, 10. K/min, 280. C @ 10. min |
Capillary | DB-1 | 1562. | D'agostino and Provost, 1988 | 15. m/0.32 mm/0.25 μm, He, 50. C @ 2. min, 10. K/min, 300. C @ 5. min |
Capillary | DB-5 | 1626.3 | D'agostino and Provost, 1988 | 15. m/0.32 mm/0.25 μm, 50. C @ 2. min, 10. K/min, 300. C @ 5. min |
Capillary | DB-1 | 1561.7 | D'Agostino and Provost, 1985 | 15. m/0.32 mm/0.25 μm, He, 50. C @ 2. min, 10. K/min, 300. C @ 5. min |
Capillary | DB-5 | 1626.3 | D'Agostino and Provost, 1985 | 15. m/0.32 mm/0.25 μm, He, 50. C @ 2. min, 10. K/min; Tend: 300. C |

Van Den Dool and Kratz RI, polar column, temperature ramp

Column type | Active phase | I | Reference | Comment |
---|---|---|---|---|
Capillary | DB-Wax | 2456.2 | D'Agostino and Provost, 1985 | 15. m/0.32 mm/0.25 μm, He, 50. C @ 2. min, 10. K/min, 250. C @ 5. min |

References

Stephenson and Malanowski, 1987
Stephenson, Richard M.; Malanowski, Stanislaw,
Handbook of the Thermodynamics of Organic Compounds, 1987, https://doi.org/10.1007/978-94-009-3173-2
. [all data]
Redemann, Chaikin, et al., 1948
Redemann, C. Ernst; Chaikin, Saul W.; Fearing, Ralph B.,
The Volatility and Vapor Pressure of Eight 2-Chloroethyl Alkyl (or Cycloalkyl) Sulfides 1,
J. Am. Chem. Soc., 1948, 70, 2, 631-633, https://doi.org/10.1021/ja01182a059
. [all data]
Dykyj, Svoboda, et al., 1999
Dykyj, J.; Svoboda, J.; Wilhoit, R.C.; Frenkel, M.L.; Hall, K.R.,
Vapor Pressure of Chemicals: Part A. Vapor Pressure and Antoine Constants for Hydrocarbons and Sulfur, Selenium, Tellurium and Hydrogen Containing Organic Compounds, Springer, Berlin, 1999, 373. [all data]
Kostiainen, 2000
Kostiainen, O.,
Gas Chromatography in Screening of Chemicals Related to the Chemical Weapons Convention
in Encyclopedia of Analytical Chemistry, Meyers, R.A., ed(s)., John Wiley Sons Ltd, Chichester, 2000, 963-979. [all data]
D'agostino and Provost, 1988
D'agostino, P.A.; Provost, L.R.,
Gas chromatographic retention indices of sulphur vesicants and related compounds,
J. Chromatogr., 1988, 436, 399-411, https://doi.org/10.1016/S0021-9673(00)94599-0
. [all data]
D'Agostino and Provost, 1985
D'Agostino, P.A.; Provost, L.R.,
Gas chromatographic retention indices of chemical warfare agents and simulants,
J. Chromatogr., 1985, 331, 47-54, https://doi.org/10.1016/0021-9673(85)80005-4
. [all data]