Potassium anion
- Formula: K-
- Molecular weight: 39.0988
- CAS Registry Number: 19128-96-2

Reaction thermochemistry data

Data compiled by: John E. Bartmess
Individual Reactions
Quantity | Value | Units | Method | Reference | Comment |
---|---|---|---|---|---|
ΔrH° | 344.130 ± 0.010 | kcal/mol | D-EA | Andersson, Sandstrom, et al., 2000 | gas phase; Given: 0.501459(12) eV |
Quantity | Value | Units | Method | Reference | Comment |
ΔrG° | 339.48 ± 0.30 | kcal/mol | H-TS | Andersson, Sandstrom, et al., 2000 | gas phase; Given: 0.501459(12) eV |

Gas phase ion energetics data

Data compiled by: John E. Bartmess
Electron affinity of neutral species
EAneutral (eV) | Method | Reference | Comment |
---|---|---|---|
0.501463 | LPD | Andersson, Sandstrom, et al., 2000 | Given: 0.501459(12) eV |
0.501463 ± 0.000087 | LPD | Slater, Read, et al., 1978 |
Protonation reactions
Quantity | Value | Units | Method | Reference | Comment |
---|---|---|---|---|---|
ΔrH° | 344.130 ± 0.010 | kcal/mol | D-EA | Andersson, Sandstrom, et al., 2000 | gas phase; Given: 0.501459(12) eV |
Quantity | Value | Units | Method | Reference | Comment |
ΔrG° | 339.48 ± 0.30 | kcal/mol | H-TS | Andersson, Sandstrom, et al., 2000 | gas phase; Given: 0.501459(12) eV |

Gas phase thermochemistry data

Quantity | Value | Units | Method | Reference | Comment |
---|---|---|---|---|---|
S°gas,1 bar | 36.946 | cal/mol*K | Review | Chase, 1998 | Data last reviewed in December, 1983 |

References

Andersson, Sandstrom, et al., 2000
Andersson, K.T.; Sandstrom, J.; Kiyan, I.Y.; Hanstorp, D.; Pegg, D.J.,
Measurement of the electron affinity of potassium - art. no. 022503,
Phys. Rev. A, 2000, 62, 2, 22503, https://doi.org/10.1103/PhysRevA.62.022503
. [all data]
Slater, Read, et al., 1978
Slater, J.; Read, F.H.; Novick, S.E.; Lineberger, W.C.,
Alkali Negative Ions. III. Multichannel Photodetachment of Cs- and K-,
Phys. Rev. A, 1978, 17, 1, 201, https://doi.org/10.1103/PhysRevA.17.201
. [all data]