Anthracene, tetradecahydro-, (4aα,8aα,9aα,10aα)-
- Formula: C14H24
- Molecular weight: 192.3404
- IUPAC Standard InChIKey: GVJFFQYXVOJXFI-LVEBTZEWSA-N
- CAS Registry Number: 19128-78-0
- Chemical structure:
View 3d structure (requires JavaScript / HTML 5) - Stereoisomers:
- Anthracene, tetradecahydro-, (4aα,8aα,9aβ,10aα)-
- Perhydroanthracene, (4aα, 8aα, 9aα, 10aβ)-
- trans-anti-trans-Tetra-decahydroanthracene
- Perhydroanthracene, (4aα, 8aβ, 9aα, 10aβ)-
- Anthracene, tetradecahydro-
- Tricyclo[8.4.0.0(3,8)]dodecane, isomer # 1
- Tricyclo[8.4.0.0(3,8)]dodecane, isomer # 2
- Tricyclo[8.4.0.0(3,8)]dodecane, isomer # 3
- Tricyclo[8.4.0.0(3,8)]dodecane, isomer # 4
- Tricyclo[8.4.0.0(3,8)]dodecane, isomer # 5
- Other names: cis-cisoid-cis-perhydroanthracene

Condensed phase thermochemistry data

Data compiled by: Hussein Y. Afeefy, Joel F. Liebman, and Stephen E. Stein
Quantity | Value | Units | Method | Reference | Comment |
---|---|---|---|---|---|
ΔfH°solid | -313.9 ± 2.5 | kJ/mol | Ccb | Frisch, 1962 | |
Quantity | Value | Units | Method | Reference | Comment |
ΔcH°solid | -8625.2 ± 1.7 | kJ/mol | Ccb | Frisch, 1962 | Corresponding ΔfHºsolid = -313.9 kJ/mol (simple calculation by NIST; no Washburn corrections) |

Gas phase ion energetics data

Data compiled as indicated in comments:
LBLHLM - Sharon G. Lias, John E. Bartmess, Joel F. Liebman, John L. Holmes, Rhoda D. Levin, and W. Gary Mallard
Ionization energy determinations
IE (eV) | Method | Reference | Comment |
---|---|---|---|
9.0 | PE | Heilbronner, Honegger, et al., 1984 | LBLHLM |

References

Frisch, 1962
Frisch, M.A.,
A high precision calorimeter for ther measurement of small energy differences, Ph.D. Thesis for University of Wisconsin, 1962, 1-100. [all data]