9-Methoxyfluorene
- Formula: C14H12O
- Molecular weight: 196.2445
- IUPAC Standard InChIKey: JGLHXBNHKQAROV-UHFFFAOYSA-N
- CAS Registry Number: 19126-15-9
- Chemical structure:
View 3d structure (requires JavaScript / HTML 5) - Permanent link for this species. Use this link for bookmarking this species for future reference.

Reaction thermochemistry data

Data compiled by: John E. Bartmess
Individual Reactions
C14H11O- + =
By formula: C14H11O- + H+ = C14H12O
Quantity | Value | Units | Method | Reference | Comment |
---|---|---|---|---|---|
ΔrH° | 1469. ± 8.8 | kJ/mol | G+TS | Taft, 1991 | gas phase |
Quantity | Value | Units | Method | Reference | Comment |
ΔrG° | 1436. ± 8.4 | kJ/mol | IMRE | Taft, 1991 | gas phase |

Gas phase ion energetics data

Data compiled by: John E. Bartmess
De-protonation reactions
C14H11O- + =
By formula: C14H11O- + H+ = C14H12O
Quantity | Value | Units | Method | Reference | Comment |
---|---|---|---|---|---|
ΔrH° | 1469. ± 8.8 | kJ/mol | G+TS | Taft, 1991 | gas phase |
Quantity | Value | Units | Method | Reference | Comment |
ΔrG° | 1436. ± 8.4 | kJ/mol | IMRE | Taft, 1991 | gas phase |

References

Taft, 1991
Taft, R.W.,
, personal communication, Aug, 1991. [all data]