(E)-5-octen-2-one
- Formula: C8H14O
- Molecular weight: 126.1962
- IUPAC Standard InChIKey: NBFKNCBRFJKDDR-SNAWJCMRSA-N
- CAS Registry Number: 19093-20-0
- Chemical structure:
View 3d structure (requires JavaScript / HTML 5) - Stereoisomers:
- Other names: (E)-oct-5-en-2-one

Van Den Dool and Kratz RI, non-polar column, temperature ramp

Column type | Active phase | I | Reference | Comment |
---|---|---|---|---|
Capillary | CP Sil 8 CB | 987. | Elmore, Campo, et al., 2002 | 60. m/0.25 mm/0.25 μm, He, 40. C @ 2. min, 4. K/min; Tend: 280. C |

References

Elmore, Campo, et al., 2002
Elmore, J.S.; Campo, M.M.; Enser, M.; Mottram, D.S.,
Effect of lipid composition on meat-like model systems containing cysteine, ribose, and polyunsaturated fatty acids,
J. Agric. Food Chem., 2002, 50, 5, 1126-1132, https://doi.org/10.1021/jf0108718
. [all data]