Ethylnitramine
- Formula: C2H6N2O2
- Molecular weight: 90.0812
- IUPAC Standard InChIKey: AHLHDIKRENEJHF-UHFFFAOYSA-N
- CAS Registry Number: 19091-98-6
- Chemical structure:
View 3d structure (requires JavaScript / HTML 5) - Permanent link for this species. Use this link for bookmarking this species for future reference.

Condensed phase thermochemistry data

Data compiled by: Hussein Y. Afeefy, Joel F. Liebman, and Stephen E. Stein
Quantity | Value | Units | Method | Reference | Comment |
---|---|---|---|---|---|
ΔcH°liquid | -1559. | kJ/mol | Ccb | Handrick, 1956 | Naval Powder Factory Report 88, 1954 |

References

Handrick, 1956
Handrick, G.R.,
Report of the study of pure explosive compounds. Part IV. Calculation of heat of combustion of organic compounds from structural features and calculation of power of high explosives, Rpt. C-58247 for the Office of the Chief of Ordnance, contract DA-19-020-ORD-47 by the Arthur D. Little, Inc., Cambridge, MA, 1956, 467-573. [all data]