2H-Thiopyran-3(4H)-one, dihydro-
- Formula: C5H8OS
- Molecular weight: 116.181
- IUPAC Standard InChIKey: ATAMXDLUUTYFKT-UHFFFAOYSA-N
- CAS Registry Number: 19090-03-0
- Chemical structure:
View 3d structure (requires JavaScript / HTML 5) - Other names: Dihydro-2H-thiopyran-3(4H)-one; Tetrahydrothiopyran-3-one; 1-Thiacyclohexan-3-one; 3-Oxotetrahydrothiopyran; 3-Thiacyclohexanone; 5,6-Dihydro-2(H)-thiopyran-3(4H)-one; Tetrahydrothia-3-pyranone

Gas phase thermochemistry data

Data compiled by: Hussein Y. Afeefy, Joel F. Liebman, and Stephen E. Stein
Quantity | Value | Units | Method | Reference | Comment |
---|---|---|---|---|---|
ΔfH°gas | -133.0 ± 2.6 | kJ/mol | Ccb | Geiseler and Sawistowsky, 1972 |

Condensed phase thermochemistry data

Data compiled by: Hussein Y. Afeefy, Joel F. Liebman, and Stephen E. Stein
Quantity | Value | Units | Method | Reference | Comment |
---|---|---|---|---|---|
ΔcH°liquid | -3531. ± 2.5 | kJ/mol | Ccb | Geiseler and Sawistowsky, 1972 |

Phase change data

Data compiled by: Hussein Y. Afeefy, Joel F. Liebman, and Stephen E. Stein
Quantity | Value | Units | Method | Reference | Comment |
---|---|---|---|---|---|
ΔvapH° | 49.3 ± 0.1 | kJ/mol | V | Geiseler and Sawistowsky, 1972 |

Normal alkane RI, polar column, temperature ramp

View large format table.

Column type Active phase I Reference Comment
CapillarySupelcowax-101541.Girard and Durance, 200060. m/0.25 mm/0.25 μm, He, 35. C @ 10. min, 4. K/min; Tend: 200. C

References

Geiseler and Sawistowsky, 1972
Geiseler, V.G.; Sawistowsky, J.,
Bildungsenthalpien und Mesomerieenergien von π-Bindungssystemen. 4. Mitteilung: Bildungsenthalpien einiger Thiacyclannone,
Z. Phys. Chem. (Leipzig), 1972, 250, 43-48. [all data]