2-Butenoic acid, hexyl ester
- Formula: C10H18O2
- Molecular weight: 170.2487
- IUPAC Standard InChIKey: MZNHUHNWGVUEAT-XBXARRHUSA-N
- CAS Registry Number: 19089-92-0
- Chemical structure:
View 3d structure (requires JavaScript / HTML 5) - Species with the same structure:
- Other names: Crotonic acid, hexyl ester; Hexyl crotonate; Hexyl 2-butenoate; n-Hexyl 2-butenoate

Kovats' RI, non-polar column, isothermal

Column type | Active phase | Temperature (C) | I | Reference | Comment |
---|---|---|---|---|---|
Packed | SE-30 | 150. | 1202. | Ashes and Haken, 1975 | He, Celatom silanized (62-72 mesh); Column length: 3.7 m |

Normal alkane RI, polar column, temperature ramp

Column type | Active phase | I | Reference | Comment |
---|---|---|---|---|
Capillary | DB-Wax | 1226. | Souza, Re-Poppi, et al., 2012 | 30. m/0.25 mm/0.25 μm, Helium, 60. C @ 1. min, 5. K/min; Tend: 240. C |

References

Ashes and Haken, 1975
Ashes, J.R.; Haken, J.K.,
Gas chromatography of homologous esters. IX. Structure-retention increments of unsaturated esters,
J. Chromatogr., 1975, 111, 1, 171-187, https://doi.org/10.1016/S0021-9673(01)80159-X
. [all data]
Souza, Re-Poppi, et al., 2012
Souza, J.B.G.; Re-Poppi, N.; Raposo, J.L.(Jr).,
Characterization of pyroligneous acid used in agriculture by gas chromatography - mass spectrometry (in press),
J. Braz. Chem. Soc., 2012, 00, 00, 1-8. [all data]