Benzo[ghi]cyclopenta[cd]perylene
- Formula: C24H12
- Molecular weight: 300.3521
- IUPAC Standard InChIKey: MUDPUADNICLBBZ-UHFFFAOYSA-N
- CAS Registry Number: 190-88-5
- Chemical structure:
View 3d structure (requires JavaScript / HTML 5) - Permanent link for this species. Use this link for bookmarking this species for future reference.

Gas phase thermochemistry data

Data compiled by: Glushko Thermocenter, Russian Academy of Sciences, Moscow
Constant pressure heat capacity of gas
Cp,gas (J/mol*K) | Temperature (K) | Reference | Comment |
---|---|---|---|
47.92 | 50. | Dorofeeva O.V., 1989 | These statistically calculated values were obtained using force field approximation for polycyclic aromatic hydrocarbons to estimate the needed vibrational frequencies (see also [ Dorofeeva O.V., 1986, Moiseeva N.F., 1990]). These functions are reproduced in the reference book [ Frenkel M., 1994]. |
83.90 | 100. | ||
130.37 | 150. | ||
182.48 | 200. | ||
261.73 | 273.15 | ||
288.4 ± 6.0 | 298.15 | ||
290.35 | 300. | ||
389.11 | 400. | ||
471.13 | 500. | ||
536.59 | 600. | ||
588.62 | 700. | ||
630.39 | 800. | ||
664.36 | 900. | ||
692.33 | 1000. | ||
715.58 | 1100. | ||
735.08 | 1200. | ||
751.56 | 1300. | ||
765.57 | 1400. | ||
777.57 | 1500. |

References

Dorofeeva O.V., 1989
Dorofeeva O.V.,
Thermodynamic Properties of Gaseous Polycyclic Aromatic Hydrocarbons Containing Five-Membered Rings. Institute for High Temperatures, USSR Academy of Sciences, Preprint No.1-263 (in Russian), Moscow, 1989. [all data]
Dorofeeva O.V., 1986
Dorofeeva O.V.,
On calculation of thermodynamic properties of polycyclic aromatic hydrocarbons,
Thermochim. Acta, 1986, 102, 59-66. [all data]
Moiseeva N.F., 1990
Moiseeva N.F.,
Group additivity scheme for calculating the chemical thermodynamic properties of gaseous polycyclic aromatic hydrocarbons containing five-membered rings,
Thermochim. Acta, 1990, 168, 179-186. [all data]
Frenkel M., 1994
Frenkel M.,
Thermodynamics of Organic Compounds in the Gas State, Vol. I, II, Thermodynamics Research Center, College Station, Texas, 1994, 1994. [all data]