Glycine, N-acetyl-, ethyl ester
- Formula: C6H11NO3
- Molecular weight: 145.1564
- IUPAC Standard InChIKey: AMBDTBHJFINMSE-UHFFFAOYSA-N
- CAS Registry Number: 1906-82-7
- Chemical structure:
View 3d structure (requires JavaScript / HTML 5) - Other names: Acetylglycine ethyl ester; Ethyl acetamidoacetate; Ethyl N-acetylglycinate; N-Acetylglycine ethyl ester; Ethyl acetaminoacetate

Phase change data

Data compiled as indicated in comments:
BS - Robert L. Brown and Stephen E. Stein
AC - William E. Acree, Jr., James S. Chickos
Reduced pressure boiling point
Tboil (K) | Pressure (bar) | Reference | Comment |
---|---|---|---|
533.2 | 0.949 | Weast and Grasselli, 1989 | BS |
Enthalpy of vaporization
ΔvapH (kJ/mol) | Temperature (K) | Method | Reference | Comment |
---|---|---|---|---|
69.4 | 398. | A | Stephenson and Malanowski, 1987 | Based on data from 383. to 466. K. See also Dykyj, 1972.; AC |

References

Weast and Grasselli, 1989
CRC Handbook of Data on Organic Compounds, 2nd Editon, Weast,R.C and Grasselli, J.G., ed(s)., CRC Press, Inc., Boca Raton, FL, 1989, 1. [all data]
Stephenson and Malanowski, 1987
Stephenson, Richard M.; Malanowski, Stanislaw,
Handbook of the Thermodynamics of Organic Compounds, 1987, https://doi.org/10.1007/978-94-009-3173-2
. [all data]
Dykyj, 1972
Dykyj, J.,
Petrochemia, 1972, 12, 1, 13. [all data]