2-Propanone, 2-propenylhydrazone
- Formula: C6H12N2
- Molecular weight: 112.1729
- IUPAC Standard InChIKey: ODEDRFAFCSZTSO-UHFFFAOYSA-N
- CAS Registry Number: 19031-79-9
- Chemical structure:
View 3d structure (requires JavaScript / HTML 5) - Other names: Acetone allylhydrazone

Normal alkane RI, non-polar column, temperature ramp

Column type | Active phase | I | Reference | Comment |
---|---|---|---|---|
Capillary | OV-101 | 880. | Zenkevich, 2005 | 25. m/0.20 mm/0.10 μm, N2/He, 6. K/min; Tstart: 50. C; Tend: 250. C |

References

Zenkevich, 2005
Zenkevich, I.G.,
Experimentally measured retention indices., 2005. [all data]