Pentanedioic acid, 3-methyl-, dimethyl ester
- Formula: C8H14O4
- Molecular weight: 174.1944
- IUPAC Standard InChIKey: YIJLMTNDXYVGPQ-UHFFFAOYSA-N
- CAS Registry Number: 19013-37-7
- Chemical structure:
View 3d structure (requires JavaScript / HTML 5) - Other names: Glutaric acid, 3-methyl-, dimethyl ester; Dimethyl 3-methylpentanedioate; Methyl 3-methylgutarate; Dimethyl 3-methylglutarate; 3-Methyl-pentanedioic acid dimethyl ester

Normal alkane RI, non-polar column, temperature ramp

Column type | Active phase | I | Reference | Comment |
---|---|---|---|---|
Capillary | OV-101 | 1137. | Pinkston, Spiteller, et al., 1981 | H2, 80. C @ 7. min, 2. K/min; Column length: 30. m; Column diameter: 0.3 mm; Tend: 275. C |
Capillary | OV-101 | 1137. | Spiteller and Spiteller, 1979 | He, 75. C @ 7. min, 2. K/min; Column length: 25. m; Tend: 280. C |

References

Pinkston, Spiteller, et al., 1981
Pinkston, D.; Spiteller, G.; von Henning, H.; Matthaei, D.,
High-resolution gas chromatography-mass spectrometry of the methyl esters of organic acids from uremic hemofiltrates,
J. Chromatogr., 1981, 223, 1, 1-19, https://doi.org/10.1016/S0378-4347(00)80063-8
. [all data]
Spiteller and Spiteller, 1979
Spiteller, M.; Spiteller, G.,
Trennung und charakterisierung saurer harnbest and- teile,
J. Chromatogr., 1979, 164, 3, 253-317, https://doi.org/10.1016/S0378-4347(00)81232-3
. [all data]