2-Methyl-decanal
- Formula: C11H22O
- Molecular weight: 170.2918
- IUPAC Standard InChIKey: LBICMZLDYMBIGA-UHFFFAOYSA-N
- CAS Registry Number: 19009-56-4
- Chemical structure:
View 3d structure (requires JavaScript / HTML 5) - Other names: 2-methyldecan-1-al

Kovats' RI, non-polar column, isothermal

Column type | Active phase | Temperature (C) | I | Reference | Comment |
---|---|---|---|---|---|
Capillary | SE-30 | 100. | 1274.0 | Tudor, 1997 | 40. m/0.35 mm/0.35 μm |

Normal alkane RI, non-polar column, temperature ramp

Column type | Active phase | I | Reference | Comment |
---|---|---|---|---|
Capillary | HP-5 | 1251. | Saidana, Mahjoub, et al., 2008 | 30. m/0.25 mm/0.25 μm, Nitrogen, 50. C @ 1. min, 5. K/min, 280. C @ 1. min |

References

Tudor, 1997
Tudor, E.,
Temperature dependence of the retention index for perfumery compounds on a SE-30 glass capillary column. I. Linear equations,
J. Chromatogr. A, 1997, 779, 1-2, 287-297, https://doi.org/10.1016/S0021-9673(97)00453-6
. [all data]
Saidana, Mahjoub, et al., 2008
Saidana, D.; Mahjoub, M.A.; Boussaada, O.; Chriaa, J.; Cheraif, I.; Daami, M.; Mighri, Z.; Helal, A.N.,
Chemical composition and antimicrobial activity of volatile compounds of Tamarix boveana (Tamaricaceae),
Microbiol. Res., 2008, 163, 4, 445-455, https://doi.org/10.1016/j.micres.2006.07.009
. [all data]