Cyclohexanol, 4-(1,1-dimethylethyl)-, acetate, trans-
- Formula: C12H22O2
- Molecular weight: 198.3019
- IUPAC Standard InChIKey: MBZRJSQZCBXRGK-XYPYZODXSA-N
- CAS Registry Number: 1900-69-2
- Chemical structure:
View 3d structure (requires JavaScript / HTML 5) - Stereoisomers:
- Other names: p-tert-Butyl cyclohexyl-acetate trans; 4-tert-Butylcyclohexyl acetate, (E)-; trans-4-tert-butylcyclohexyl acetate

Normal alkane RI, non-polar column, custom temperature program

Column type | Active phase | I | Reference | Comment |
---|---|---|---|---|
Capillary | SE-30 | 1322. | Vinogradov, 2004 | Program: not specified |

Normal alkane RI, polar column, custom temperature program

Column type | Active phase | I | Reference | Comment |
---|---|---|---|---|
Capillary | Carbowax 20M | 1628. | Vinogradov, 2004 | Program: not specified |

References

Vinogradov, 2004
Vinogradov, B.A.,
Production, composition, properties and application of essential oils, 2004, retrieved from http://viness.narod.ru. [all data]