Thallium octanoate
- Formula: C8H15O2Tl
- Molecular weight: 347.5868
- IUPAC Standard InChIKey: FWHYAAFZQBJZLE-UHFFFAOYSA-M
- CAS Registry Number: 18993-50-5
- Chemical structure:
View 3d structure (requires JavaScript / HTML 5) - Permanent link for this species. Use this link for bookmarking this species for future reference.

Condensed phase thermochemistry data

Data compiled by: Eugene S. Domalski and Elizabeth D. Hearing
Constant pressure heat capacity of solid
Cp,solid (J/mol*K) | Temperature (K) | Reference | Comment |
---|---|---|---|
294. | 305. | Roux, Turrion, et al., 1989 | T = 305 to 490 K. |

References

Roux, Turrion, et al., 1989
Roux, M.V.; Turrion, C.; Fernandez-Martin, F.; Lopez de la Fuente, F.L.; Cheda, J.A.R.,
DSC thermophysics on osme medium chain thallium(I) n-alkanoates: Phase transitions, thermal functions and heat capacity,
Thermochim. Acta, 1989, 139, 139-148. [all data]