9H-Carbazole, 3-methoxy-
- Formula: C13H11NO
- Molecular weight: 197.2325
- IUPAC Standard InChIKey: BISIQSCKDZYPLR-UHFFFAOYSA-N
- CAS Registry Number: 18992-85-3
- Chemical structure:
View 3d structure (requires JavaScript / HTML 5) - Other names: Carbazole, 3-methoxy-; 3-Methoxycarbazole

Phase change data

Data compiled by: Thermodynamics Research Center, NIST Boulder Laboratories, Chris Muzny director
Quantity | Value | Units | Method | Reference | Comment |
---|---|---|---|---|---|
Tfus | 422. | K | N/A | Smith and Hall, 1962 | Uncertainty assigned by TRC = 4. K |
Tfus | 411.65 | K | N/A | Borsche, 1908 | Uncertainty assigned by TRC = 2. K |

References

Smith and Hall, 1962
Smith, P.A.S.; Hall, J.H.,
Kinetic Evidence for the Formation of Azene (Electron-deficient Nitrogen) Intermediates from Aryl Azides,
J. Am. Chem. Soc., 1962, 84, 480-5. [all data]
Borsche, 1908
Borsche, W.,
On tetra- & hexahydrocarbazole compounds and a new carbazole synthesis.,
Justus Liebigs Ann. Chem., 1908, 359, 49. [all data]