Scandium,tris(1,1,1,5,5,5-hexafluoro-2,4-pentanedionato-o,o')-

Phase change data

Data compiled by: William E. Acree, Jr., James S. Chickos

Enthalpy of sublimation

ΔsubH (kJ/mol) Temperature (K) Method Reference
55.0333. - 363.TGAFahlman and Barron, 2000
60.2 ± 1.2313. - 348.IKomissarova, Gurevich, et al., 1978

Gas phase ion energetics data

Data compiled as indicated in comments:
LLK - Sharon G. Lias, Rhoda D. Levin, and Sherif A. Kafafi
B - John E. Bartmess

Electron affinity determinations

EA (eV) Method Reference Comment
2.78 ± 0.13IMRBSharpe, Eyler, et al., 1990EA given is actually -ΔGea(350 K). Between fluoranil, Cr(CF3COCHCOCF3)3; B

Ionization energy determinations

IE (eV) Method Reference Comment
9.43 ± 0.05EIWestmore, Reimer, et al., 1981LLK
9.6 ± 0.2PEWestmore, Reimer, et al., 1981LLK
10.13 ± 0.07PEEvans, Hamnett, et al., 1972Vertical value; LLK

References

Fahlman and Barron, 2000
Fahlman, Bradley D.; Barron, Andrew R., Substituent effects on the volatility of metal ?-diketonates, Adv. Mater. Opt. Electron., 2000, 10, 3-5, 223-232, https://doi.org/10.1002/1099-0712(200005/10)10:3/5<223::AID-AMO411>3.0.CO;2-M . [all data]

Komissarova, Gurevich, et al., 1978
Komissarova, L.N.; Gurevich, M.Z.; Sas, T.S.; Stepin, B.D., Zh. Neorg. Khim., 1978, 23, 3145. [all data]