Piperazine, 1,4-diacetyl-
- Formula: C8H14N2O2
- Molecular weight: 170.2090
- IUPAC Standard InChIKey: NBQBICYRKOTWRR-UHFFFAOYSA-N
- CAS Registry Number: 18940-57-3
- Chemical structure:

Kovats' RI, non-polar column, temperature ramp

Column type | Active phase | I | Reference | Comment |
---|---|---|---|---|
Capillary | HP-1 | 1780. | Staack and Maurer, 2004 | 12. m/0.20 mm/0.33 μm, He, 100. C @ 3. min, 30. K/min, 310. C @ 8. min |
Capillary | HP-1 | 1780. | Staack and Maurer, 2004, 2 | 12. m/0.20 mm/0.33 μm, He, 100. C @ 3. min, 30. K/min, 310. C @ 8. min |
Capillary | Cross-Linked Methylsilicone | 1750. | Staack, Fritschi, et al., 2002 | 12. m/0.2 mm/0.33 μm, He, 100. C @ 3. min, 30. K/min, 300. C @ 8. min |

References

Staack and Maurer, 2004
Staack, R.F.; Maurer, H.H.,
New designer drug 1-(3,4-methylenedioxybenzyl) piperazine (MDBP): studies on its metabolism and toxicological detection in rat urine using gas chromatography/mass spectrometry,
J. Mass Spectrom., 2004, 39, 3, 255-261, https://doi.org/10.1002/jms.556
. [all data]
Staack and Maurer, 2004, 2
Staack, R.F.; Maurer, H.H.,
Studies on the metabolism and the toxicological analysis of the nootropic drug fipexide in rat urine using gas chromatography-mass spectrometry,
J. Chromatogr. B, 2004, 804, 2, 337-343, https://doi.org/10.1016/j.jchromb.2004.01.035
. [all data]
Staack, Fritschi, et al., 2002
Staack, R.F.; Fritschi, G.; Maurer, H.H.,
Studies on the metabolism and toxicological detection of the new designer drug N-benzylpiperazine in urine using gas chromatography-mass spectrometry,
J. Chromatogr. B, 2002, 773, 1, 35-46, https://doi.org/10.1016/S1570-0232(01)00619-5
. [all data]