methyl hex-2-ynoate
- Formula: C7H10O2
- Molecular weight: 126.1531
- IUPAC Standard InChIKey: DHZPZBFOJDXEHS-UHFFFAOYSA-N
- CAS Registry Number: 18937-79-6
- Chemical structure:
View 3d structure (requires JavaScript / HTML 5) - Other names: 2-Hexynoic acid methyl ester

Phase change data

Data compiled by: Robert L. Brown and Stephen E. Stein
Reduced pressure boiling point
Tboil (K) | Pressure (bar) | Reference |
---|---|---|
338. | 0.013 | Farchan Laboratories, 1990 |
354.2 | 0.031 | Weast and Grasselli, 1989 |

Reaction thermochemistry data

Data compiled by: Hussein Y. Afeefy, Joel F. Liebman, and Stephen E. Stein

Individual Reactions

2Hydrogen + methyl hex-2-ynoate = Hexanoic acid, methyl ester

By formula: 2H2 + C7H10O2 = C7H14O2

Quantity Value Units Method Reference Comment
Δr-71.1 ± 1.2kcal/molChydFlitcroft and Skinner, 1958liquid phase

References

Farchan Laboratories, 1990
Farchan Laboratories,
Research Chemicals Catalog, Farchan Laboratories, Gainesville, FL, 1990, 91. [all data]
Weast and Grasselli, 1989
CRC Handbook of Data on Organic Compounds, 2nd Editon, Weast,R.C and Grasselli, J.G., ed(s)., CRC Press, Inc., Boca Raton, FL, 1989, 1. [all data]