Benzeneacetic acid, 3-methoxy-, methyl ester
- Formula: C10H12O3
- Molecular weight: 180.2005
- IUPAC Standard InChIKey: BSVIOYCZTJRBDB-UHFFFAOYSA-N
- CAS Registry Number: 18927-05-4
- Chemical structure:
View 3d structure (requires JavaScript / HTML 5) - Other names: Acetic acid, (m-methoxyphenyl)-, methyl ester; Methyl (3-methoxyphenyl)acetate; Methyl m-methoxyphenylacetate; Methyl 2-(m-methoxyphenyl)acetate; Acetic acid, 3-methoxyphenoxy, methyl ester; Methyl 2-(3-methoxyphenyl)acetate; (3-Methoxy-phenyl)-acetic acid methyl ester

Van Den Dool and Kratz RI, non-polar column, custom temperature program

Column type | Active phase | I | Reference | Comment |
---|---|---|---|---|
Capillary | HP-5MS | 1416.9 | Andriamaharavo, 2014 | 30. m/0.25 mm/0.25 μm, He; Program: 60C (1 min) => 5 C/min => 210C => 10 C/min => 280C (15 min) |

Normal alkane RI, non-polar column, temperature ramp

Column type | Active phase | I | Reference | Comment |
---|---|---|---|---|
Capillary | OV-101 | 1380. | Pinkston, Spiteller, et al., 1981 | H2, 80. C @ 7. min, 2. K/min; Column length: 30. m; Column diameter: 0.3 mm; Tend: 275. C |
Capillary | OV-101 | 1380. | Spiteller and Spiteller, 1979 | He, 75. C @ 7. min, 2. K/min; Column length: 25. m; Tend: 280. C |

References

Andriamaharavo, 2014
Andriamaharavo, N.R.,
Retention Data. NIST Mass Spectrometry Data Center., NIST Mass Spectrometry Data Center, 2014. [all data]
Pinkston, Spiteller, et al., 1981
Pinkston, D.; Spiteller, G.; von Henning, H.; Matthaei, D.,
High-resolution gas chromatography-mass spectrometry of the methyl esters of organic acids from uremic hemofiltrates,
J. Chromatogr., 1981, 223, 1, 1-19, https://doi.org/10.1016/S0378-4347(00)80063-8
. [all data]
Spiteller and Spiteller, 1979
Spiteller, M.; Spiteller, G.,
Trennung und charakterisierung saurer harnbest and- teile,
J. Chromatogr., 1979, 164, 3, 253-317, https://doi.org/10.1016/S0378-4347(00)81232-3
. [all data]