Ethanol, 2,2'-dithiobis-
- Formula: C4H10O2S2
- Molecular weight: 154.251
- IUPAC Standard InChIKey: KYNFOMQIXZUKRK-UHFFFAOYSA-N
- CAS Registry Number: 1892-29-1
- Chemical structure:
View 3d structure (requires JavaScript / HTML 5) - Other names: Ethanol, 2,2'-dithiodi-; Bis(2-hydroxyethyl) disulfide; Diethanol disulfide; Dithiodiglycol; Hydroxyethyl disulfide; 2-Hydroxyethanedisulfide; 2-Hydroxyethyl disulfide; 2,2'-Dithiodiethanol; 3,4-Dithia-1,6-hexanediol; USAF TH-9; 2,2'-Dithiobisethanol; 2-Mercaptoethanol disulfide; NSC 33920; β-Hydroxyethyl disulfide

Phase change data

Data compiled by: Robert L. Brown and Stephen E. Stein
Reduced pressure boiling point
Tboil (K) | Pressure (bar) | Reference |
---|---|---|
433.7 | 0.005 | Weast and Grasselli, 1989 |

Van Den Dool and Kratz RI, non-polar column, temperature ramp

Column type | Active phase | I | Reference | Comment |
---|---|---|---|---|
Capillary | SE-54 | 1425. | Kostiainen, 2000 | 25. m/0.32 mm/0.25 μm, He, 40. C @ 1. min, 10. K/min, 280. C @ 10. min |

References

Weast and Grasselli, 1989
CRC Handbook of Data on Organic Compounds, 2nd Editon, Weast,R.C and Grasselli, J.G., ed(s)., CRC Press, Inc., Boca Raton, FL, 1989, 1. [all data]
Kostiainen, 2000
Kostiainen, O.,
Gas Chromatography in Screening of Chemicals Related to the Chemical Weapons Convention
in Encyclopedia of Analytical Chemistry, Meyers, R.A., ed(s)., John Wiley Sons Ltd, Chichester, 2000, 963-979. [all data]