2,3-Butadien-1-ol
- Formula: C4H6O
- Molecular weight: 70.0898
- IUPAC Standard InChIKey: JXKCVRNKAPHWJG-UHFFFAOYSA-N
- CAS Registry Number: 18913-31-0
- Chemical structure:
View 3d structure (requires JavaScript / HTML 5) - Permanent link for this species. Use this link for bookmarking this species for future reference.

Normal alkane RI, non-polar column, custom temperature program

Column type | Active phase | I | Reference | Comment |
---|---|---|---|---|
Capillary | Methyl Silicone | 663. | Zenkevich, 1996 | Program: not specified |

Gas phase ion energetics data

Data compiled as indicated in comments:
LBLHLM - Sharon G. Lias, John E. Bartmess, Joel F. Liebman, John L. Holmes, Rhoda D. Levin, and W. Gary Mallard
LLK - Sharon G. Lias, Rhoda D. Levin, and Sherif A. Kafafi

Ionization energy determinations

IE (eV) Method Reference Comment
8.74EIHolmes and Lossing, 1986LBLHLM
8.74EITerlouw, Heerma, et al., 1980LLK

References

Zenkevich, 1996
Zenkevich, I.G.,
Informational Maitenance of Gas Chromatographic Identification of Organic Compounds in Ecoanalytical Investigations,
Z. Anal. Chem., 1996, 51, 11, 1140-1148. [all data]