Hexaphenylethane
- Formula: C38H30
- Molecular weight: 486.6448
- IUPAC Standard InChIKey: FWSYACUVHKGULL-UHFFFAOYSA-N
- CAS Registry Number: 18909-18-7
- Chemical structure:
View 3d structure (requires JavaScript / HTML 5) - Permanent link for this species. Use this link for bookmarking this species for future reference.

Condensed phase thermochemistry data

Data compiled by: Hussein Y. Afeefy, Joel F. Liebman, and Stephen E. Stein
Quantity | Value | Units | Method | Reference | Comment |
---|---|---|---|---|---|
ΔfH°solid | 674.9 | kJ/mol | Ccb | Schmidlin, 1906 | Author hf298_condensed=142 kcal/mol |
Quantity | Value | Units | Method | Reference | Comment |
ΔcH°solid | -19920. | kJ/mol | Ccb | Schmidlin, 1906 | Author hf298_condensed=142 kcal/mol; Corresponding ΔfHºsolid = 674. kJ/mol (simple calculation by NIST; no Washburn corrections) |

Phase change data

Data compiled by: William E. Acree, Jr., James S. Chickos
Enthalpy of sublimation
ΔsubH (kJ/mol) | Temperature (K) | Method | Reference | Comment |
---|---|---|---|---|
114.6 | 363. | A | Stephenson and Malanowski, 1987 | Based on data from 348. to 394. K. |

References

Schmidlin, 1906
Schmidlin, M.J.,
Recherches chimiques et thermochimiques sur la constitution des rosanilines,
Ann. Chim. Phys., 1906, 1, 195-256. [all data]
Stephenson and Malanowski, 1987
Stephenson, Richard M.; Malanowski, Stanislaw,
Handbook of the Thermodynamics of Organic Compounds, 1987, https://doi.org/10.1007/978-94-009-3173-2
. [all data]