Hexachloropropene
- Formula: C3Cl6
- Molecular weight: 248.750
- IUPAC Standard InChIKey: VFDYKPARTDCDCU-UHFFFAOYSA-N
- CAS Registry Number: 1888-71-7
- Chemical structure:
View 3d structure (requires JavaScript / HTML 5) - Other names: 1-Propene, 1,1,2,3,3,3-hexachloro-; Propene, hexachloro-; Hexachloropropylene; Perchloropropene; Perchloropropylene; Rcra waste number U243; 1-Propene, hexachloro-; 1,1,2,3,3,3-Hexachloro-1-propene; NSC 7297

Phase change data

Data compiled as indicated in comments:
BS - Robert L. Brown and Stephen E. Stein
TRC - Thermodynamics Research Center, NIST Boulder Laboratories, Chris Muzny director
AC - William E. Acree, Jr., James S. Chickos
Quantity | Value | Units | Method | Reference | Comment |
---|---|---|---|---|---|
Tboil | 482.7 | K | N/A | Weast and Grasselli, 1989 | BS |
Tboil | 484.8 | K | N/A | Prober, 1954 | Uncertainty assigned by TRC = 0.8 K; TRC |
Quantity | Value | Units | Method | Reference | Comment |
Tc | 680. | K | N/A | Steele, Chirico, et al., 1997 | Uncertainty assigned by TRC = 5. K; TRC |
Quantity | Value | Units | Method | Reference | Comment |
Pc | 25.00 | bar | N/A | Steele, Chirico, et al., 1997 | Uncertainty assigned by TRC = 2.00 bar; derived from fit of obs. vapor pressure; TRC |
Quantity | Value | Units | Method | Reference | Comment |
ρc | 1.95 | mol/l | N/A | Steele, Chirico, et al., 1997 | Uncertainty assigned by TRC = 0.060 mol/l; TRC |
Quantity | Value | Units | Method | Reference | Comment |
ΔvapH° | 54.8 ± 0.4 | kJ/mol | EB | Steele, Chirico, et al., 1997, 2 | Based on data from 366. to 510. K.; AC |
Enthalpy of vaporization
ΔvapH (kJ/mol) | Temperature (K) | Method | Reference | Comment |
---|---|---|---|---|
49.3 | 397. | A | Stephenson and Malanowski, 1987 | Based on data from 382. to 540. K. See also Dykyj, 1970.; AC |

Normal alkane RI, non-polar column, custom temperature program

Column type | Active phase | I | Reference | Comment |
---|---|---|---|---|
Capillary | Methyl Silicone | 1166. | Zenkevich, 2001 | Program: not specified |
Capillary | Methyl Silicone | 1166. | Zenkevich, 2001 | Program: not specified |

Lee's RI, non-polar column, temperature ramp

Column type | Active phase | I | Reference | Comment |
---|---|---|---|---|
Capillary | DB-5MS | 203.65 | Chen, Keeran, et al., 2002 | 30. m/0.25 mm/0.5 μm, 40. C @ 1. min, 10. K/min; Tend: 310. C |
Capillary | DB-5MS | 203.60 | Chen, Keeran, et al., 2002 | 30. m/0.25 mm/0.5 μm, 40. C @ 1. min, 4. K/min; Tend: 310. C |

References

Weast and Grasselli, 1989
CRC Handbook of Data on Organic Compounds, 2nd Editon, Weast,R.C and Grasselli, J.G., ed(s)., CRC Press, Inc., Boca Raton, FL, 1989, 1. [all data]
Prober, 1954
Prober, M.,
The Disproportionation of Allylic CHlorofluoro Compounds,
J. Am. Chem. Soc., 1954, 67, 4189-91. [all data]
Steele, Chirico, et al., 1997
Steele, W.V.; Chirico, R.D.; Knipmeyer, S.E.; Nguyen, A.; Smith, N.K.,
Thermocynamic Properties and Ideal-Gas Enthalpies of Formation for Carbonate, Piperazine, Hexachloroprop-1-ene, Tetrakis(dimethylamino) ethylene, N,N'-Bis(2-hydroxyethyl)ethylenediamine, and 1,2,4-Tr,
J. Chem. Eng. Data, 1997, 42, 1037-52. [all data]
Steele, Chirico, et al., 1997, 2
Steele, W.V.; Chirico, R.D.; Knipmeyer, S.E.; Nguyen, A.; Smith, N.K.,
Thermodynamic Properties and Ideal-Gas Enthalpies of Formation for Dicyclohexyl Sulfide, Diethylenetriamine, Di- n -octyl Sulfide, Dimethyl Carbonate, Piperazine, Hexachloroprop-1-ene, Tetrakis(dimethylamino)ethylene, N , N '-Bis-(2-hydroxyethyl)ethylenediamine, and 1,2,4-Triazolo[1,5- a ]pyrimidine,
J. Chem. Eng. Data, 1997, 42, 6, 1037-1052, https://doi.org/10.1021/je9700986
. [all data]
Stephenson and Malanowski, 1987
Stephenson, Richard M.; Malanowski, Stanislaw,
Handbook of the Thermodynamics of Organic Compounds, 1987, https://doi.org/10.1007/978-94-009-3173-2
. [all data]
Dykyj, 1970
Dykyj, J.,
Petrochemica, 1970, 10, 2, 51. [all data]
Zenkevich, 2001
Zenkevich, I.G.,
Comparative Characterization of Conditions for Unambuguous Chromatographic Identification of Organic Compounds,
Zh. Anal. Khim., 2001, 56, 9, 915-924. [all data]
Chen, Keeran, et al., 2002
Chen, P.H.; Keeran, W.S.; Van Ausdale, W.A.; Schindler, D.R.; Roberts, D.W.,
Application of Lee retention indices to the confirmation of tentatively identified compounds from GC/MS analysis of environmental samples, Technical paper, Analytical Services Division, Environmental ScienceEngineering, Inc, PO Box 1703, Gainesville, FL 32602, 2002, 11. [all data]