3-Hexanone, 2,5-dimethyl-
- Formula: C8H16O
- Molecular weight: 128.2120
- IUPAC Standard InChIKey: TUIWMHDSXJWXOH-UHFFFAOYSA-N
- CAS Registry Number: 1888-57-9
- Chemical structure:
View 3d structure (requires JavaScript / HTML 5) - Other names: Isobutyl isopropyl ketone; 2,5-Dimethyl-3-hexanone

Phase change data

Data compiled as indicated in comments:
BS - Robert L. Brown and Stephen E. Stein
TRC - Thermodynamics Research Center, NIST Boulder Laboratories, Chris Muzny director
Quantity | Value | Units | Method | Reference | Comment |
---|---|---|---|---|---|
Tboil | 420.7 | K | N/A | Weast and Grasselli, 1989 | BS |
Tboil | 416. | K | N/A | Leroide, 1921 | Uncertainty assigned by TRC = 4. K; TRC |
Tboil | 466. | K | N/A | Mailhe, 1921 | Uncertainty assigned by TRC = 30. K; TRC |
Tboil | 421. | K | N/A | Favorskii, 1913 | Uncertainty assigned by TRC = 3. K; TRC |

Van Den Dool and Kratz RI, polar column, temperature ramp

Column type | Active phase | I | Reference | Comment |
---|---|---|---|---|
Capillary | Carbowax 20M | 1145. | Verzera, Campisi, et al., 2005 | 60. m/0.25 mm/0.25 μm, He, 45. C @ 0.17 min, 2. K/min; Tend: 250. C |
Capillary | CP-Wax 52CB | 1145. | Verzera, Campisi, et al., 2001 | 60. m/0.25 mm/0.25 μm, He, 45. C @ 0.17 min, 2. K/min; Tend: 250. C |

Normal alkane RI, polar column, custom temperature program

Column type | Active phase | I | Reference | Comment |
---|---|---|---|---|
Capillary | Carbowax 20M | 1145. | Editorial paper, 2005 | Program: not specified |

References

Weast and Grasselli, 1989
CRC Handbook of Data on Organic Compounds, 2nd Editon, Weast,R.C and Grasselli, J.G., ed(s)., CRC Press, Inc., Boca Raton, FL, 1989, 1. [all data]
Leroide, 1921
Leroide, J.,
Ann. Chim. (Paris), 1921, 16, 354. [all data]
Mailhe, 1921
Mailhe, A.,
Bull. Soc. Chim. Fr., 1921, 29, 219. [all data]
Favorskii, 1913
Favorskii, A.,
J. Prakt. Chem., 1913, 88, 641. [all data]
Verzera, Campisi, et al., 2005
Verzera, A.; Campisi, S.; Zappalá, M.,
SUPELCO. Using SPME-GC-MS to characterize volatile components of honey as indicators of botanical origin, 2005, retrieved from http://www.sigmaaldrich.com/Brands/SupelcoHome/TheReporter.html. [all data]
Verzera, Campisi, et al., 2001
Verzera, A.; Campisi, S.; Zappalá, M.; Bonaccorsi, I.,
SPME-GC-MS analysis of honey volatile components for the characterization of different floral origin,
Am. Lab. Fairfield Conn., 2001, 33, 15, 18-21. [all data]
Editorial paper, 2005
Editorial paper,
Solid Phase Microextraction (SPME) Application Guide,
The Reporter Europe (Supelco), 2005, 16, 5, 12-12. [all data]