Androstane-3,17-diol, (3β,5β,17β)-, 2TMS derivative
- Formula: C25H48O2Si2
- Molecular weight: 436.8184
- IUPAC Standard InChIKey: KBSHKNYEUGMMDQ-PFDHWQDWSA-N
- CAS Registry Number: 18880-48-3
- Chemical structure:
View 3d structure (requires JavaScript / HTML 5) - Stereoisomers:
- Androstane-3,17-diol, (3α,5α,17α)-, 2TMS derivative
- Androstane-3,17-diol, (3α,5α,17β)-, 2TMS derivative
- Androstane-3,17-diol, (3α,5β,17β)-, 2TMS derivative
- Androstane-3,17-diol, (3β,5α,17β)-, 2TMS derivative
- 5-β-Androstan-3-β,17-α-diol, TMS
- 5α-Androstan-3α,17β-diol, TMS
- 5α-Androstane-3β,17β-diol,bis-TMS
- 5β-Androstane-3α,17β-diol,bis-TMS
- 5β-Androstane-3β,17β-diol,bis-TMS
- 5A-Androstane-3B,17A-diol, TMS
- Other names: 3,17-Bis[(trimethylsilyl)oxy]-5β-androstane, (3β,17β)-; 5β-Androstane-3β,17β-diol bis(trimethylsilyl) deriv.; 5-β-Androstan-3-β,17-β-diol, (2TMS); 5β-Androstanediol-3β,17β, bis-TMS; 5-β-Androstan-3-β,17-β-diol, TMS; 5.beta.-Androstane-3.beta.,17.beta.-diol, bis(trimethylsilyl) ether

Kovats' RI, non-polar column, isothermal

Column type | Active phase | Temperature (C) | I | Reference | Comment |
---|---|---|---|---|---|
Packed | OV-101 | 207. | 2545. | Berthou, Picart, et al., 1976 | Column length: 2.1 m |
Capillary | OV-101 | 252. | 2570. | Berthou, Picart, et al., 1976 | Column length: 55. m; Column diameter: 0.37 mm |

Van Den Dool and Kratz RI, non-polar column, temperature ramp

Column type | Active phase | I | Reference | Comment |
---|---|---|---|---|
Capillary | BP-1 | 2560. | Houghton, Ginn, et al., 1989 | H2, 5. K/min; Column length: 25. m; Column diameter: 0.3 mm; Tstart: 150. C; Tend: 300. C |
Capillary | BP-5 | 2571. | Houghton, Ginn, et al., 1989 | H2, 5. K/min; Column length: 25. m; Column diameter: 0.3 mm; Tstart: 150. C; Tend: 300. C |

References

Berthou, Picart, et al., 1976
Berthou, F.; Picart, D.; Bardou, L.; Floch, H.H.,
Separation of C19 and C21 dihydroxysteroids by open-hole tubular glass columns and lipophilic gel chromatography,
J. Chromatogr., 1976, 118, 2, 135-155, https://doi.org/10.1016/S0021-9673(00)81203-0
. [all data]
Houghton, Ginn, et al., 1989
Houghton, E.; Ginn, A.; Teale, P.; Dumasia, M.C.; Copsey, J.,
Comparison of the use of mass spectrometry and methylene unit values in the determination of the stereochemistry of estranediol, the major urinary metabolite of 19-nortestosterone in the horse,
J. Chromatogr., 1989, 479, 73-83, https://doi.org/10.1016/S0021-9673(01)83318-5
. [all data]