1,1-dimethoxyethyl(dimethyl)amine
- Formula: C6H15NO2
- Molecular weight: 133.1888
- IUPAC Standard InChIKey: FBZVZUSVGKOWHG-UHFFFAOYSA-N
- CAS Registry Number: 18871-66-4
- Chemical structure:
View 3d structure (requires JavaScript / HTML 5) - Other names: N,N-Dimethylacetamide dimethyl acetal

Gas phase thermochemistry data

Data compiled by: Hussein Y. Afeefy, Joel F. Liebman, and Stephen E. Stein
Quantity | Value | Units | Method | Reference | Comment |
---|---|---|---|---|---|
ΔfH°gas | -387. | kJ/mol | Cm | Guthrie, 1974 | Heat of hydrolysis[kcal/mol]=-14.5 |

Condensed phase thermochemistry data

Data compiled by: Hussein Y. Afeefy, Joel F. Liebman, and Stephen E. Stein
Quantity | Value | Units | Method | Reference | Comment |
---|---|---|---|---|---|
ΔfH°liquid | -428.4 | kJ/mol | Cm | Guthrie, 1974 | Heat of hydrolysis[kcal/mol]=-14.5 |

References

Guthrie, 1974
Guthrie, J.P.,
Hydration of carboxamides. Evaluation of the free energy change for addition of water to acetamide and formamide derivatives,
J. Am. Chem. Soc., 1974, 96, 3608-3615. [all data]