propane, 1-[2-(ethenyloxy)ethoxy]-
- Formula: C7H14O2
- Molecular weight: 130.1849
- IUPAC Standard InChIKey: DSCPDECZHTVJOJ-UHFFFAOYSA-N
- CAS Registry Number: 18854-26-7
- Chemical structure:
View 3d structure (requires JavaScript / HTML 5) - Permanent link for this species. Use this link for bookmarking this species for future reference.

Phase change data

Data compiled by: Thermodynamics Research Center, NIST Boulder Laboratories, Chris Muzny director
Quantity | Value | Units | Method | Reference | Comment |
---|---|---|---|---|---|
Tboil | 416. | K | N/A | Mikhant'ev, Mikhant'ev, et al., 1966 | Uncertainty assigned by TRC = 4. K |

References

Mikhant'ev, Mikhant'ev, et al., 1966
Mikhant'ev, B.I.; Mikhant'ev, V.B.; Mikhant'eva, O.N.,
Synthesis of Vinyl and Allyl Ethers of Alkoxyethanols,
Tr. Probl. Lab. Khim. Vysokomol. Soedin., Voronezh. Gos. Univ., 1966, No. 4, 34-41. [all data]