Isoxathion
- Formula: C13H16NO4PS
- Molecular weight: 313.309
- IUPAC Standard InChIKey: SDMSCIWHRZJSRN-UHFFFAOYSA-N
- CAS Registry Number: 18854-01-8
- Chemical structure:
View 3d structure (requires JavaScript / HTML 5) - Other names: Phosphorothioic acid, O,O-diethyl O-(5-phenyl-3-isoxazolyl) ester; O,O-Diethyl O-(5-phenyl-3-isoxazolyl) phosphorothioate; O,O-Diethyl O-(3-(5-phenyl)-1,2-isoxazolyl)phosphorothionate; E-48; Karphos; SI-6711; O,O-Diethyl-O-(5-phenylisoxazol-3-yl) thiophosphate; O,O-diethyl O-5-phenylisoxazol-3-ylphosphorothioate

Kovats' RI, non-polar column, isothermal

Column type | Active phase | Temperature (C) | I | Reference | Comment |
---|---|---|---|---|---|
Packed | SE-30 | 210. | 2168. | Oyama, Sano, et al., 1987 | N2, AW-DMCS; Column diameter: 0.53 mm |

Van Den Dool and Kratz RI, non-polar column, temperature ramp

Column type | Active phase | I | Reference | Comment |
---|---|---|---|---|
Packed | OV-1 | 2155. | Oyama, Sano, et al., 1987 | N2, AW-DMCS, 2. K/min; Column diameter: 0.53 mm; Tstart: 80. C; Tend: 220. C |

Normal alkane RI, non-polar column, isothermal

Column type | Active phase | Temperature (C) | I | Reference | Comment |
---|---|---|---|---|---|
Packed | OV-1 | 190. | 2160. | TSunoda, 1986 | Helium, Chromosorb W AW DMCS; Column length: 1. m |

Normal alkane RI, non-polar column, temperature ramp

Column type | Active phase | I | Reference | Comment |
---|---|---|---|---|
Packed | OV-1 | 2155. | TSunoda, 1986 | Helium, Chromosorb W AW DMCS, 4. K/min, 210. C @ 20. min; Column length: 1. m; Tstart: 140. C |

Normal alkane RI, non-polar column, custom temperature program

Column type | Active phase | I | Reference | Comment |
---|---|---|---|---|
Capillary | Ultra-1 | 2145. | Tameo and Kiyos, 1991 | Program: not specified |

References

Oyama, Sano, et al., 1987
Oyama, N.; Sano, T.; Syoyama, M.; Maeda, K.,
Studies on systematic analysis of poisonous compounds in forensic chemistry. II. Application of capillary column gas chromatography to substance identification by means of retention indices,
Eisei Kagaku, 1987, 33, 5, 342-348, https://doi.org/10.1248/jhs1956.33.342
. [all data]
TSunoda, 1986
TSunoda, N.,
Simultaneous determination of organophosphorous pesticides in forencis chemistry by gas-liquid chromatography with hydrogen flame ionization detector,
Eisei Kagaku, 1986, 32, 2, 91-100, https://doi.org/10.1248/jhs1956.32.91
. [all data]
Tameo and Kiyos, 1991
Tameo, O.; Kiyos, I.,
Simultaneous determination of pesticides by capillary gas chromatography,
Cannot be traslated (in Japan), 1991, 14, 2, 109-122. [all data]