Benzonitrile, 2-amino-
- Formula: C7H6N2
- Molecular weight: 118.1359
- IUPAC Standard InChIKey: HLCPWBZNUKCSBN-UHFFFAOYSA-N
- CAS Registry Number: 1885-29-6
- Chemical structure:
View 3d structure (requires JavaScript / HTML 5) - Other names: Anthranilonitrile; o-Aminobenzonitrile; o-Cyanoaniline; Benzonitrile, o-amino-; 2-Aminobenzonitrile; 2-Cyano-1-aminobenzene; 2-Cyanoaniline

Phase change data

Data compiled by: Robert L. Brown and Stephen E. Stein
Quantity | Value | Units | Method | Reference | Comment |
---|---|---|---|---|---|
Tboil | 540.7 | K | N/A | Aldrich Chemical Company Inc., 1990 | |
Tboil | 535. to 536. | K | N/A | Buckingham and Donaghy, 1982 | |
Quantity | Value | Units | Method | Reference | Comment |
Tfus | 323. to 324. | K | N/A | Buckingham and Donaghy, 1982 |
Reduced pressure boiling point
Tboil (K) | Pressure (bar) | Reference |
---|---|---|
405. to 409. | 0.015 | Buckingham and Donaghy, 1982 |

References

Aldrich Chemical Company Inc., 1990
Aldrich Chemical Company Inc.,
Catalog Handbook of Fine Chemicals, Aldrich Chemical Company, Inc., Milwaukee WI, 1990, 1. [all data]
Buckingham and Donaghy, 1982
Buckingham, J.; Donaghy, S.M.,
Dictionary of Organic Compounds: Fifth Edition, Chapman and Hall, New York, 1982, 1. [all data]