2-Nonenal, (E)-
- Formula: C9H16O
- Molecular weight: 140.2227
- IUPAC Standard InChIKey: BSAIUMLZVGUGKX-BQYQJAHWSA-N
- CAS Registry Number: 18829-56-6
- Chemical structure:
View 3d structure (requires JavaScript / HTML 5) - Stereoisomers:
- Other names: (E)-2-Nonenal; trans-2-Nonen-1-al; trans-2-Nonenal; (2E)-2-Nonenal; 2E-Nonen-1-al; (2E)nonenal; (E)-2-Nonen-1-al; (E)-Non-2-enal; Non-2-(E)-enal; t-2-Nonenal; trans-Non-2-enal

Phase change data

Data compiled as indicated in comments:
BS - Robert L. Brown and Stephen E. Stein
AC - William E. Acree, Jr., James S. Chickos
Reduced pressure boiling point
Tboil (K) | Pressure (bar) | Reference | Comment |
---|---|---|---|
362.2 | 0.016 | Aldrich Chemical Company Inc., 1990 | BS |
Enthalpy of vaporization
ΔvapH (kJ/mol) | Temperature (K) | Method | Reference | Comment |
---|---|---|---|---|
56.1 | 378. | A | Stephenson and Malanowski, 1987 | Based on data from 363. to 398. K.; AC |

Normal alkane RI, non-polar column, custom temperature program

Data compiled by: NIST Mass Spectrometry Data Center, William E. Wallace, director

Column type CapillaryCapillaryCapillaryCapillaryCapillary
Active phase TR-5 MSRTX-1Siloxane, 5 % PhVF-5 MSDB-5
Column length (m) 15.60. 30.60.
Carrier gas HeliumHelium HeliumHelium
Substrate
Column diameter (mm) 0.250.22 0.250.25
Phase thickness (μm) 0.250.25 0.251.00
Program 35 0C (3 min) 2 0C/min -> 60 0C (3 min) 2 0C/min -> 80 0C (3 min) 4 0C/min -> 120 0C (3 min) 5 0C/min -> 150 0C (3 min) 15 0C/min -> 240 0C (10 min)not specifiednot specifiednot specified40 0C 4 0C/min -> 230 0C 100 0C/min -> 260 0C (11.7 min)
I 1157.1133.1159.1164.1163.
ReferenceKurashov, Mitrukova, et al., 2014Bendiabdellah, El Amine Dib, et al., 2012VOC BinBase, 2012Liu, Lu, et al., 2011Miyazaki, Plotto, et al., 2011
Comment MSDC-RI MSDC-RI MSDC-RI MSDC-RI MSDC-RI
Column type CapillaryCapillaryCapillaryCapillaryCapillary
Active phase Polydimethyl siloxane, 5 % phenylCP Sil-5 CBHP-5HP-5 MSCP-Sil 5 CB
Column length (m)  50.30.30.50.
Carrier gas  NitrogenHeliumHeliumNitrogen
Substrate
Column diameter (mm)  0.320.320.320.32
Phase thickness (μm)  1.200.250.251.20
Program not specified36 0C 20 0C/min -> 85 0C 1 0C/min -> 145 0C 3 0C/min -> 250 0Cnot specifiednot specified36 0C 20 0C/min -> 85 0C 1 0C -> 145 0C 3 0C/min -> 250 0C
I 1159.1130.1162.1161.1130.
ReferenceSkogerson, Wohlgemuth, et al., 2011Bailly and Collin, 2010Kahriman, Tosun, et al., 2010Pino, Marquez, et al., 2010Bailly, Jerkovic, et al., 2009
Comment MSDC-RI MSDC-RI MSDC-RI MSDC-RI MSDC-RI
Column type CapillaryCapillaryCapillaryCapillaryCapillary
Active phase SE-54HP-5 MSZB-5DB-5HP-5
Column length (m) 30.60.30.50.50.
Carrier gas HeliumHeliumHeliumHeliumHelium
Substrate
Column diameter (mm) 0.320.320.250.320.32
Phase thickness (μm) 0.251.00.250.251.05
Program 35 0C (2 min) 10 0C/min -> 50 0C (2 min) 6 0C/min -> 250 0C120 0C 2 0C/min -> 240 0C 10 0C/min -> 270 0C (2 min)45 0C 3 0C/min -> 230 0C (10 min) 10 0C/min -> 270 0C (21 min)60 0C (2 min) 5 0C/min -> 160 0C (1 min) 10 0C/min -> 250 0C (3 min)40 0C (10 min) 5 0C/min -> 200 0C 15 0C/min -> 250 0C (10 min)
I 1161.1174.1159.1161.1170.
ReferenceChristlbauer and Schieberle, 2009Dharmawan, Kasapis, et al., 2009de Simon, Estruelas, et al., 2009Judzentiene and Budiene, 2008Ventanas, Estevez, et al., 2008
Comment MSDC-RI MSDC-RI MSDC-RI MSDC-RI MSDC-RI
Column type CapillaryCapillaryCapillaryCapillaryCapillary
Active phase DB-5 MSHP-5 MSHP-5 MSDB-5DB-5
Column length (m) 30.30.30.30.30.
Carrier gas HeliumHeliumHelium
Substrate
Column diameter (mm) 0.320.250.250.250.32
Phase thickness (μm) 1.00.250.250.250.25
Program -10 0C (3 min) 50 0C/min -> 40 0C 5 0C/min -> 290 0C (5 min)40 0C (2 min) 4 0C/min -> 220 0C 20 0C/min -> 280 0C40 0C (2 min) 4 0C/min -> 220 0C 20 0C/min -> 280 0C50C(1min) => 5C/min => 100C => 10C/min => 250C (9min)40C(2min) => 40C/min => 60C(2min) => 6C/min => 180C => 15C/min => 230C(10min)
I 1165.1162.1163.1162.1157.
ReferenceWatanabe, Ueda, et al., 2008Xie, Sun, et al., 2008Xie, Sun, et al., 2008Beaulieu and Lancaster, 2007Buettner, 2007
Comment MSDC-RI MSDC-RI MSDC-RI MSDC-RI MSDC-RI
Column type CapillaryCapillaryCapillaryCapillaryCapillary
Active phase DB-5HP-5DB-5HP-5DB-5 MS
Column length (m) 30.30.30. 60.
Carrier gas  HeHe Helium
Substrate
Column diameter (mm) 0.320.320.25 0.32
Phase thickness (μm) 0.250.250.25 1.0
Program 40C(2min) => 40C/min => 60C(2min) => 6C/min => 180C => 15C/min => 230C(10min)40 0C (2 min) 110 0C (2 min) 3 0C/min -> 170 0C (2 min) 4 0C/min -> 220 0C (2 min) 10 0C/min -> 260 0C (5 min)40C(1min) => 7C/min => 110C => 5C/min => 180C => 10C/min => 240C(10min)not specified40 0C (2 min) 6 0C/min -> 100 0C 4 0C/min -> 180 0C 8 0C/min -> 250 0C (12 min)
I 1161.1160.1160.1160.1165.
ReferenceBuettner, 2007Dou, Li, et al., 2007Greger and Schieberle, 2007Liolios, Laouer, et al., 2007Liu, Xu, et al., 2007
Comment MSDC-RI MSDC-RI MSDC-RI MSDC-RI MSDC-RI
Column type CapillaryCapillaryCapillaryCapillaryCapillary
Active phase HP-5MSDB-5HP-5CP-Sil 5 CBCP Sil 5 CB
Column length (m)  50. 50.50.
Carrier gas  HeliumHeHeliumHe
Substrate
Column diameter (mm)  0.32 0.320.32
Phase thickness (μm)  0.25 1.201.2
Program not specified60 0C (1 min) 5 0C/min -> 160 0C 10 0C/min -> 250 0C50C => 3C/min => 200C(10min) => 10C/min => 290C(10min)36 0C 20 0C/min -> 85 0C 1 0C/min -> 1345 0C 3 0C/min -> 250 0C36C => 20C/min => 85C => 1C/min => 145C => 3C/min => 250C
I 1163.1162.1165.1133.1133.
ReferenceMallia, Escher, et al., 2007Nivinsliene, Butkiene, et al., 2007Splivallo, Bossi, et al., 2007Bailly, Jerkovic, et al., 2006Bailly, Jerkovic, et al., 2006, 2
Comment MSDC-RI MSDC-RI MSDC-RI MSDC-RI MSDC-RI
Column type CapillaryCapillaryCapillaryCapillaryCapillary
Active phase 5 % Phenyl methyl siloxaneSE-54CP-Sil5 CB MSDB-5CP-Sil 5 CB
Column length (m) 30.30.50.60.50.
Carrier gas  HeliumN2 Nitrogen
Substrate
Column diameter (mm) 0.250.320.320.250.32
Phase thickness (μm) 0.750.251.20.251.2
Program 50C(1min) => 5C/min => 100C => 10C/min => 190C => 30C/min => 250C(1min)not specified36C => 20C/min => 85C => 1C/min => 145C => 3C/min => 250C(30min)50C => 5C/min => 100C => 15C/min => 250C (19C)36 0C 20 0C/min -> 85 0C 1 iC/min -> 145 0C 3 0C/min -> 250 0C
I 1167.1164.1147.1162.1147.
ReferenceBeaulieu J.C. and Lea J.M., 2006Blank, Lin, et al., 2006Callemien, Dasnoy, et al., 2006Beaulieu, 2005Callamien, Dasnoy, et al., 2005
Comment MSDC-RI MSDC-RI MSDC-RI MSDC-RI MSDC-RI
Column type CapillaryCapillaryCapillaryCapillaryCapillary
Active phase CP-Sil 5 CBBP-5BP-5BP-5BP-5
Column length (m) 50.25.25.25.25.
Carrier gas NitrogenHeliumHeliumHeliumHelium
Substrate
Column diameter (mm) 0.320.320.320.320.32
Phase thickness (μm) 1.200.500.500.500.50
Program 36 0C 20 0C/min -> 85 0C 1 0C/min -> 145 0C 3 0C/min -> 250 0C60 0C 6 0C/min -> 210 0C 10 0C/min -> 290 0C (10 min)not specified60 0C 6 0C/min -> 210 0C 10 0C/min -> 290 0C (10 min)60 0C 6 0C/min -> 210 0C 10 0C/min -> 290 0C (10 min)
I 1147.1176.1162.1165.1165.
ReferenceCallemien, Dasnoy, et al., 2005Eyres, Dufour, et al., 2005Eyres, Dufour, et al., 2005Eyres, Dufour, et al., 2005Eyres, Dufour, et al., 2005
Comment MSDC-RI MSDC-RI MSDC-RI MSDC-RI MSDC-RI
Column type CapillaryCapillaryCapillaryCapillaryCapillary
Active phase BP-5BP-5BP-5BP-5HP-5
Column length (m) 25.25.25.25.
Carrier gas HeliumHeliumHeliumHelium
Substrate
Column diameter (mm) 0.320.320.320.32
Phase thickness (μm) 0.500.500.500.50
Program 60 0C 6 0C/min -> 210 0C 10 0C/min -> 290 0C (10 min)60 0C 6 0C/min -> 210 0C 10 0C/min -> 290 0C (10 min)60 0C 6 0C/min -> 210 0C 10 0C/min -> 290 0C (10 min)60 0C 6 0C/min -> 210 0C 10 0C/min -> 290 0C (10 min)not specified
I 1170.1170.1172.1173.1162.
ReferenceEyres, Dufour, et al., 2005Eyres, Dufour, et al., 2005Eyres, Dufour, et al., 2005Eyres, Dufour, et al., 2005Riu-Aumatell, Lopez-Tamames, et al., 2005
Comment MSDC-RI MSDC-RI MSDC-RI MSDC-RI MSDC-RI
Column type CapillaryCapillaryCapillaryCapillaryCapillary
Active phase SE-54SE-54SE-54SE-54HP-1
Column length (m) 30.30.30.30.12.
Carrier gas HeHeHeHe
Substrate
Column diameter (mm) 0.320.320.320.320.32
Phase thickness (μm) 0.250.250.250.250.52
Program 40C (2min) => 40C/min => 50C(2min) => 6C/min => 180C => 15C/min => 230C(10min)40C (2min) => 40C/min => 50C(2min) => 6C/min => 180C => 15C/min => 230C(10min)40C(2min) => 40C/min => 50C(2min) => 6C/min => 180C => 15C/min => 230C (10min)40C(2min) => 40C/min => 50C(2min) => 6C/min => 180C => 15C/min => 230C (10min)35C(3min) => 6C/min => 190C => 30C/min => 225C
I 1157.1157.1157.1157.1128.
ReferenceBuettner and Welle, 2004Buettner and Welle, 2004Buettner, 2004Buettner, 2004Carpino, Mallia, et al., 2004
Comment MSDC-RI MSDC-RI MSDC-RI MSDC-RI MSDC-RI
Column type CapillaryCapillaryCapillaryCapillaryCapillary
Active phase HP-1SPB-5HP-5SE-30SE-54
Column length (m) 25.30.50. 30.
Carrier gas  He
Substrate
Column diameter (mm) 0.20.250.32 0.32
Phase thickness (μm) 0.110.251.05 0.25
Program 35C(3min) => 4C/min => 190C => 30C/min => 225C(3min)30C(3min) => 5C/min => 80C => 4C/min => 95C => 5C/min => 115C => 10C/min => 200C40C(10min) => 5C/min => 200C => 20C/min => 250C(5min)not specified35C (2min) => 40C/min => 50C (2min) => 6C/min => 180C => 10C/min => 230C (10min)
I 1128.1171.1164.1146.1163.
ReferenceCarpino, Mallia, et al., 2004, 2Crook, Boylston, et al., 2004Garcia-Estaban, Ansorena, et al., 2004Vinogradov, 2004Buettner, Mestres, et al., 2003
Comment MSDC-RI MSDC-RI MSDC-RI MSDC-RI MSDC-RI
Column type CapillaryCapillaryCapillaryCapillaryCapillary
Active phase DB-5DB-5CP-Sil 5 CBHP-5MSMFE-73
Column length (m) 30.30.50.30.30.
Carrier gas H2 HeliumHeH2
Substrate
Column diameter (mm) 0.30.530.320.250.32
Phase thickness (μm) 0.251.51.200.250.1
Program 35C (1min) => 40C/min => 60C (5min) => 4C/min => 240C-5C(1min) => 4C/min => 50C => 6C/min => 120C => 8C/min => 250C(2min)36 0C 20 0C/min -> 85 0C 1 0C/min -> 145 0C 3 0C/min -> 250 0C (30 min)40C (10min) => 3C/min => 120C => 10C/min => 250C (5min)40C(5min) => 2C/min => 120C => 10C/min => 210C(30min)
I 1156.1154.1123.1161.1158.
ReferenceTriqui and Bouchriti, 2003Bücking and Steinhart, 2002Gijs, Chevanese, et al., 2002Ansorena, Gimeno, et al., 2001Aznar, López, et al., 2001
Comment MSDC-RI MSDC-RI MSDC-RI MSDC-RI MSDC-RI
Column type CapillaryCapillaryCapillaryCapillaryCapillary
Active phase MFE-73BPX-5OV-101DB-5SE-54
Column length (m) 30.50. 30.30.
Carrier gas H2Helium He
Substrate
Column diameter (mm) 0.320.32 0.320.32
Phase thickness (μm) 0.10.50 0.250.25
Program 40 C (5min) => 2C/min => 120C => 10 C/min => 210 C (30min)40 0C (5 min) 20 0C/min -> 60 0C (5 min) 4 0C/min -> 250 0C (10 min)not specified35C(1min) => 40C/min => 60C (1min) => 6C/min => 230C35 0C (2 min) 40 0C/min -> 50 0C (1 min) 6 0C/min -> 230 0C
I 1158.1173.1126.1169.1160.
ReferenceFerreira, Aznar, et al., 2001Madruga, Arruda, et al., 2000Licker, Acree, et al., 1998Matsui, Guth, et al., 1998Reiners and Grosch, 1998
Comment MSDC-RI MSDC-RI MSDC-RI MSDC-RI MSDC-RI
Column type CapillaryCapillaryCapillaryCapillaryCapillary
Active phase SE-54SE-54SE-54SE-54SE-54
Column length (m) 25.30.30.30.30.
Carrier gas HeHeHeHeHe
Substrate
Column diameter (mm) 0.320.320.320.320.32
Phase thickness (μm) 0.25 0.250.250.25
Program 35C(2min) => 50C/min => 60C(2min) => 4C/min => 230C35C => 40C/min => 60C (1min) => 6C/min => 250C35C (2min) => 40C/min => 60C (2min) => 6C/min => 180C => 10C/min => 240C35C (2min) => 40C/min => 60C (2min) => 6C/min => 180C => 10C/min => 240C35C (2min) => 40C/min => 60C (2min) => 6C/min => 180C => 10C/min => 240C
I 1159.1156.1161.1161.1161.
ReferenceZehentbauer and Grosch, 1998Lizárraga-Guerra, Guth, et al., 1997Schermann and Schieberle, 1997Schermann and Schieberle, 1997Schermann and Schieberle, 1997
Comment MSDC-RI MSDC-RI MSDC-RI MSDC-RI MSDC-RI
Column type CapillaryCapillaryCapillaryCapillaryCapillary
Active phase DB-5DB-5SE-54SE-54SE-54
Column length (m) 30.30. 30.
Carrier gas  He He
Substrate
Column diameter (mm) 0.320.32 0.32
Phase thickness (μm)
Program not specified35C => 40C/min => 50C(2min) => 4C/min => 240Cnot specified40 0C -> (unknowm rate) 50 0C (2 min) 6 0C/min -> 200 0Cnot specified
I 1161.1161.1160.1162.1160.
ReferenceSchieberle, 1996Schieberle and Grosch, 1994Guth and Grosch, 1993Milo and Grosch, 1993Blank, Sen, et al., 1992
Comment MSDC-RI MSDC-RI MSDC-RI MSDC-RI MSDC-RI
Column type CapillaryCapillary
Active phase SE-54OV-101
Column length (m) 30.
Carrier gas
Substrate
Column diameter (mm) 0.32
Phase thickness (μm) 0.20
Program 2 min at 35 0C; 35-50 0C at 40 deg/min; 5 min at 50 0C; 50 - 220 0C at 4 deg/min;not specified
I 1161.1146.
ReferenceSchieberle, Ofner, et al., 1990Shibamoto, 1987
Comment MSDC-RI MSDC-RI

Kovats' RI, non-polar column, temperature ramp

Data compiled by: NIST Mass Spectrometry Data Center, William E. Wallace, director

Column type CapillaryCapillaryCapillaryCapillaryCapillary
Active phase HP-5MSBP-1DB-1DB-1DB-1
Column length (m) 30.25.28.60.60.
Carrier gas HeN2He
Substrate
Column diameter (mm) 0.250.550.250.250.25
Phase thickness (μm) 0.250.250.250.250.25
Tstart (C) 50.60.50.30.30.
Tend (C) 250.220.270.220.220.
Heat rate (K/min) 3.5.4.52.2.
Initial hold (min) 10. 1.4.4.
Final hold (min) 5.15.
I 1162.1149.1136.1134.1142.
ReferenceAsuming, Beauchamp, et al., 2005Srivastava, Ahmad, et al., 2003Nagalakshmi, Thangadurai, et al., 2001Takeoka, Perrino, et al., 1996Takeoka, Perrino, et al., 1996
Comment MSDC-RI MSDC-RI MSDC-RI MSDC-RI MSDC-RI
Column type CapillaryCapillaryCapillaryCapillaryCapillary
Active phase DB-1DB-1DB-1SE-30SE-30
Column length (m) 28.60.60.50.50.
Carrier gas HeHeHeHeHe
Substrate
Column diameter (mm) 0.250.320.320.50.5
Phase thickness (μm) 0.250.250.25
Tstart (C) 50.30.30.40.40.
Tend (C) 270.210.210.170.170.
Heat rate (K/min) 4.2.2.3.3.
Initial hold (min) 1.4.4.3.3.
Final hold (min)
I 1136.1133.1134.1142.1142.
ReferenceSaad, El-Sharkawy, et al., 1995Takeoka, Flath, et al., 1990Takeoka, Flath, et al., 1990Greenberg, 1981Greenberg, 1981
Comment MSDC-RI MSDC-RI MSDC-RI MSDC-RI MSDC-RI

Normal alkane RI, non-polar column, temperature ramp

Data compiled by: NIST Mass Spectrometry Data Center, William E. Wallace, director

Column type CapillaryCapillaryCapillaryCapillaryCapillary
Active phase RTX-1PTE-5VF-5 MSHP-5 MSHP-5
Column length (m) 60.30.30.30.30.
Carrier gas HeliumHeliumHeliumHeliumHelium
Substrate
Column diameter (mm) 0.220.250.250.250.32
Phase thickness (μm) 0.250.250.250.250.25
Tstart (C) 60.80.40.40.60.
Tend (C) 230.300.250.260.240.
Heat rate (K/min) 2.7.5.4.3.
Initial hold (min)  3.3. 2.
Final hold (min) 5.5.3.5.
I 1135.1156.1165.1163.1164.
ReferenceBendiabdellah, El Amine Dib, et al., 2012Fabri, Coimbra, et al., 2012Liu, Lu, et al., 2011Miyazawa, Marumoto, et al., 2011Kahriman, Tosun, et al., 2010
Comment MSDC-RI MSDC-RI MSDC-RI MSDC-RI MSDC-RI
Column type CapillaryCapillaryCapillaryCapillaryCapillary
Active phase HP-5 MSHP-5 MSHP-5 MSHP-5HP-5 MS
Column length (m) 30.30.30.30.30.
Carrier gas HeliumHeliumHeliumHydrogenHelium
Substrate
Column diameter (mm) 0.250.320.250.250.25
Phase thickness (μm) 0.250.250.250.250.25
Tstart (C) 70.50.70.70.70.
Tend (C) 290.240.290.290.290.
Heat rate (K/min) 5.4.5.5.5.
Initial hold (min)  2.
Final hold (min)  10.10. 10.
I 1161.1160.1161.1162.1160.
ReferenceLazarevic, Radulovic, et al., 2010Pino, Marquez, et al., 2010Radulovic, Blagojevic, et al., 2010Radulovic, Dordevic, et al., 2010Radulovic, Dordevic, et al., 2010, 2
Comment MSDC-RI MSDC-RI MSDC-RI MSDC-RI MSDC-RI
Column type CapillaryCapillaryCapillaryCapillaryCapillary
Active phase DB-5 MSDB-5 MSHP-5 MSDB-5Mega 5 MS
Column length (m) 30.30.30.60.60.
Carrier gas HeliumHeliumHeliumHeliumHelium
Substrate
Column diameter (mm) 0.320.320.250.320.25
Phase thickness (μm) 0.250.250.250.250.25
Tstart (C) 40.40.35. 40.
Tend (C) 230.250.195.240.240.
Heat rate (K/min) 6.6.2.6.3.
Initial hold (min) 2.2.5. 2.
Final hold (min) 20.20.30.5.
I 1168.1169.1157.1163.1121.
ReferenceChen, Song, et al., 2009Chen, Song, et al., 2009Kim and Chung, 2009Mallia, Escher, et al., 2009Romeo, Verzera, et al., 2009
Comment MSDC-RI MSDC-RI MSDC-RI MSDC-RI MSDC-RI
Column type CapillaryCapillaryCapillaryCapillaryCapillary
Active phase RTX-5 MSHP-5 MSHP-5HP-5 MSSPB-1
Column length (m) 30.30.30.30.30.
Carrier gas HeliumHeliumN2HeliumHelium
Substrate
Column diameter (mm) 0.250.250.250.250.25
Phase thickness (μm) 0.500.250.250.251.0
Tstart (C) 35.50.60.50.60.
Tend (C) 225.280.220.230.250.
Heat rate (K/min) 6.4.5.4.5.
Initial hold (min) 5. 10.4.5.
Final hold (min) 10.  10.
I 1162.1160.1165.1161.1140.
ReferenceWatcharananun, Cadwallader, et al., 2009Zhao, Zeng, et al., 2009Flamini, Tebano, et al., 2008Forero, Quijano, et al., 2008Frerot, Velluz, et al., 2008
Comment MSDC-RI MSDC-RI MSDC-RI MSDC-RI MSDC-RI
Column type CapillaryCapillaryCapillaryCapillaryCapillary
Active phase DB-5DB-5HP-101HP-1DB-1
Column length (m) 30.30.25.50.60.
Carrier gas HeHeliumHeHeNitrogen
Substrate
Column diameter (mm) 0.260.260.20.20.25
Phase thickness (μm) 0.250.250.20.5
Tstart (C) 60.60.70.60.40.
Tend (C) 240.290.200.250.200.
Heat rate (K/min) 3.3.3.2.2.
Initial hold (min)   2. 1.
Final hold (min)    120.9.
I 1161.1161.1124.1131.1129.
ReferenceBos, Woerdenbag, et al., 2007Elfami, Bos, et al., 2007Jerkovic, Mastelic, et al., 2007Castel, Fernandez, et al., 2006Chen, Sheu, et al., 2006
Comment MSDC-RI MSDC-RI MSDC-RI MSDC-RI MSDC-RI
Column type CapillaryCapillaryCapillaryCapillaryCapillary
Active phase DB-5HP-5MSHP-5SPB-5HP-5
Column length (m) 30.30.30.30.30.
Carrier gas HeliumHeHeliumHeliumH2
Substrate
Column diameter (mm) 0.260.250.320.250.25
Phase thickness (μm) 0.250.250.250.250.25
Tstart (C) 60.50.40.60.50.
Tend (C) 290.250.240.250.280.
Heat rate (K/min) 3.4.4.4.4.
Initial hold (min)    2.2.
Final hold (min)   5.20.10.
I 1161.1160.1147.1154.1185.
ReferenceElfami, Komar, et al., 2006Hadaruga, Hadaruga, et al., 2006Miyazawa and Kawata, 2006Pino, Marquez, et al., 2006Pino, Sauri-Duch, et al., 2006
Comment MSDC-RI MSDC-RI MSDC-RI MSDC-RI MSDC-RI
Column type CapillaryCapillaryCapillaryCapillaryCapillary
Active phase DB-5DB-5DB-5HP-1HP-5
Column length (m) 30.30.13.550.30.
Carrier gas HeHeHeHeHe
Substrate
Column diameter (mm) 0.250.250.320.20.25
Phase thickness (μm) 0.250.25 0.50.25
Tstart (C) 40.40.35.60.60.
Tend (C) 260.250.225.250.250.
Heat rate (K/min) 2.4.6.2.10.
Initial hold (min) 5.2.3. 2.
Final hold (min) 20.10. 40.10.
I 1158.1155.1159.1138.1165.
ReferenceSenatore, Landolfi, et al., 2006Shen X., Gao Y., et al., 2006de Souza, Vásquez, et al., 2006Valette, Fernandez, et al., 2006Wang, Yang, et al., 2006
Comment MSDC-RI MSDC-RI MSDC-RI MSDC-RI MSDC-RI
Column type CapillaryCapillaryCapillaryCapillaryCapillary
Active phase HP-1BPX5MDN-5MDN-5DB-5
Column length (m) 50.25.60.60.30.
Carrier gas HeHeHeHeHe
Substrate
Column diameter (mm) 0.20.200.250.250.25
Phase thickness (μm) 0.50.130.250.250.25
Tstart (C) 60.50.40.40.40.
Tend (C) 250.230.270.270.260.
Heat rate (K/min) 2.3.4.4.2.
Initial hold (min)  2.4.4.5.
Final hold (min) 60. 5.5.20.
I 1135.1157.1162.1170.1158.
ReferenceBendimerad and Bendiab, 2005Boustie, Rapior, et al., 2005van Loon, Linssen, et al., 2005van Loon, Linssen, et al., 2005Senatore, Apostolides Arnold, et al., 2005
Comment MSDC-RI MSDC-RI MSDC-RI MSDC-RI MSDC-RI
Column type CapillaryCapillaryCapillaryCapillaryCapillary
Active phase HP-5HP-5HP-5DB-5DB-1
Column length (m) 30.30.30.30.30.
Carrier gas HeliumHeliumHeliumH2He
Substrate
Column diameter (mm) 0.320.320.320.320.25
Phase thickness (μm) 0.250.250.251.0.25
Tstart (C) 40.40.40.40.50.
Tend (C) 300.250.250.240.265.
Heat rate (K/min) 4.5.5.5.2.5
Initial hold (min)  2.2. 1.
Final hold (min) 5.5.5.10.20.
I 1157.1139.1139.1156.1123.
ReferenceUtsunomia, Kawata, et al., 2005N/AN/ALandy, Nicklaus, et al., 2004Sarkhail, Amin, et al., 2004
Comment MSDC-RI MSDC-RI MSDC-RI MSDC-RI MSDC-RI
Column type CapillaryCapillaryCapillaryCapillaryCapillary
Active phase DB-5MDN-5SPB-1DB-5DB-5
Column length (m) 60.30.30.30.30.
Carrier gas HeHeHeHeHe
Substrate
Column diameter (mm) 0.250.250.250.320.32
Phase thickness (μm) 0.250.250.250.250.25
Tstart (C) 35.40.40.40.40.
Tend (C) 280.280.200.230.230.
Heat rate (K/min) 5.20.3.6.6.
Initial hold (min) 2.1.10.2.2.
Final hold (min) 4.1. 10.10.
I 1157.1174.1132.1161.1161.
ReferenceDhanda, Pegg, et al., 2003Mildner-Szkudlarz, Jelen, et al., 2003Vichi, Castellote, et al., 2003Czerny and Schieberle, 2002Czerny and Schieberle, 2002
Comment MSDC-RI MSDC-RI MSDC-RI MSDC-RI MSDC-RI
Column type CapillaryCapillaryCapillaryCapillaryCapillary
Active phase RSL-200RSL-200DB-5SPB-5RTX-5
Column length (m) 30.30.30.30.20.
Carrier gas H2H2HeHeliumHe
Substrate
Column diameter (mm) 0.320.250.320.250.18
Phase thickness (μm) 0.250.250.250.250.4
Tstart (C) 40.40.40.60.20.
Tend (C) 280.280.290.250.290.
Heat rate (K/min) 6.6.7.4.40.
Initial hold (min) 5.2. 2.3.5
Final hold (min) 5.10. 20.0.5
I 1134.1134.1164.1158.1161.
ReferenceJirovetz, Buchbauer, et al., 2002Jirovetz, Smith, et al., 2002Lin, Rouseff, et al., 2002Pino, Marbot, et al., 2002Sies A., Hirsch R., et al., 2002
Comment MSDC-RI MSDC-RI MSDC-RI MSDC-RI MSDC-RI
Column type CapillaryCapillaryCapillaryCapillaryCapillary
Active phase Optima-1DB-5MSDB-5MSOptima-1DB-5
Column length (m) 25.30.60.25.30.
Carrier gas HeHeHeHeHe
Substrate
Column diameter (mm) 0.200.530.250.200.32
Phase thickness (μm) 0.251.50.250.250.25
Tstart (C) 50.40.40.50.40.
Tend (C) 250.225.200.250.230.
Heat rate (K/min) 3.6.2.3.6.
Initial hold (min) 3.5.5.3.2.
Final hold (min)  30.30. 5.
I 1142.1152.1163.1146.1161.
ReferenceBrun, Bessière, et al., 2001Cadwallader and Heo, 2001Lee, Suriyaphan, et al., 2001de Beck, Bessière, et al., 2000Czerny and Grosch, 2000
Comment MSDC-RI MSDC-RI MSDC-RI MSDC-RI MSDC-RI
Column type CapillaryCapillaryCapillaryCapillaryCapillary
Active phase OV-101OV-101DB-5HP-1DB-5
Column length (m) 50.50.30.25.
Carrier gas NitrogenN2
Substrate
Column diameter (mm) 0.250.20.320.20
Phase thickness (μm)   1. 0.25
Tstart (C) 40.80.40.35.34.
Tend (C) 200.200.200.250.200.
Heat rate (K/min) 2.1.3.4.5.
Initial hold (min) 10. 5. 3.
Final hold (min)  20.  10.
I 1180.1150.1146.1130.1155.
ReferenceTamura, Boonbumrung, et al., 2000Menon, Chacko, et al., 1999Meynier, Novelli, et al., 1999Ong and Acree, 1999Schlüter, Steinhart, et al., 1999
Comment MSDC-RI MSDC-RI MSDC-RI MSDC-RI MSDC-RI
Column type CapillaryCapillaryCapillaryCapillaryCapillary
Active phase DB-5 MSSE-54HP-1HP-1DB-1
Column length (m) 60.25.25.25.60.
Carrier gas Helium
Substrate
Column diameter (mm) 0.320.310.320.320.25
Phase thickness (μm) 0.25
Tstart (C) 40.35.35.35.30.
Tend (C) 200.250.250.250.200.
Heat rate (K/min) 3.4.4.4.4.
Initial hold (min) 5.3.  25.
Final hold (min) 30.   20.
I 1167.1135.1130.1130.1133.
ReferenceSuriyaphan, Drake, et al., 1999Ding, Deng, et al., 1998Ong and Acree, 1998Ong, Acree, et al., 1998Buttery, Ling, et al., 1997
Comment MSDC-RI MSDC-RI MSDC-RI MSDC-RI MSDC-RI
Column type CapillaryCapillaryCapillaryCapillaryCapillary
Active phase SE-54SPB-1DB-1OV-101OV-101
Column length (m) 30.50.60.50.50.
Carrier gas  HeHeN2N2
Substrate
Column diameter (mm) 0.520.20.250.250.25
Phase thickness (μm) 1.50.33
Tstart (C) 5.40.30.80.80.
Tend (C) 230.200.200.200.200.
Heat rate (K/min) 6.3.4.2.2.
Initial hold (min)  3.25.
Final hold (min)  30.20.
I 1162.1136.1133.1133.1135.
ReferenceMilo and Grosch, 1996Wong and Lai, 1996Buttery and Ling, 1995Tamura, Nakamoto, et al., 1995Tamura, Nakamoto, et al., 1995
Comment MSDC-RI MSDC-RI MSDC-RI MSDC-RI MSDC-RI
Column type CapillaryPackedCapillaryCapillaryCapillary
Active phase DB-5SE-54DB-1OV-101OV-101
Column length (m) 60.3.60.50.50.
Carrier gas    NitrogenNitrogen
Substrate  Chromosorb G AW DMCS (100-120 mesh)
Column diameter (mm) 0.25 0.320.250.25
Phase thickness (μm) 0.25
Tstart (C) 40.50.50.70.80.
Tend (C) 250.230.230.200.200.
Heat rate (K/min) 2.6.4.2.2.
Initial hold (min) 5.2.
Final hold (min)  10.10.
I 1161.1161.1133.1142.1138.
ReferenceLee, Macku, et al., 1991Schieberle, 1991Binder, Turner, et al., 1990Sugisawa, Nakamura, et al., 1990Sugisawa, Nakamura, et al., 1990
Comment MSDC-RI MSDC-RI MSDC-RI MSDC-RI MSDC-RI
Column type CapillaryCapillaryCapillaryCapillary
Active phase OV-101OV-101DB-1SE-30
Column length (m) 50.50.60.50.
Carrier gas N2N2
Substrate
Column diameter (mm) 0.250.250.320.5
Phase thickness (μm)
Tstart (C) 80.80.50.40.
Tend (C) 200.200.250.170.
Heat rate (K/min) 2.2.4.3.
Initial hold (min)   0.13.
Final hold (min)   5.
I 1140.1141.1132.1135.
ReferenceYang and Sugisawa, 1990Yang and Sugisawa, 1990Flath, Mon, et al., 1983Heydanek and McGorrin, 1981
Comment MSDC-RI MSDC-RI MSDC-RI MSDC-RI

Normal alkane RI, polar column, temperature ramp

Data compiled by: NIST Mass Spectrometry Data Center, William E. Wallace, director

Column type CapillaryCapillaryCapillaryCapillaryCapillary
Active phase RTX-WaxAT-WaxDB-WaxDB-WaxTC-Wax
Column length (m) 60.60.60.30.60.
Carrier gas HeliumHeliumHeliumHeliumHelium
Substrate
Column diameter (mm) 0.220.250.250.250.25
Phase thickness (μm) 0.250.250.250.25
Tstart (C) 60.60.50.40.40.
Tend (C) 230.280.220.210.230.
Heat rate (K/min) 2.4.3.3.3.
Initial hold (min)   2. 3.
Final hold (min) 5. 20.
I 1525.1534.1511.1535.1539.
ReferenceBendiabdellah, El Amine Dib, et al., 2012Kiss, Csoka, et al., 2011Onishi, Inoue, et al., 2011Kumazawa, Sakai, et al., 2010Miyazawa, Fujita, et al., 2010
Comment MSDC-RI MSDC-RI MSDC-RI MSDC-RI MSDC-RI
Column type CapillaryCapillaryCapillaryCapillaryCapillary
Active phase DB-WaxFFAPDB-WaxTC-WAXDB-Wax
Column length (m) 30.30.30.60.30.
Carrier gas HeliumHeliumHeliumHeliumHelium
Substrate
Column diameter (mm) 0.320.320.320.250.25
Phase thickness (μm) 0.250.250.25 0.25
Tstart (C) 40.40. 40.60.
Tend (C) 230.240.240.230.200.
Heat rate (K/min) 6.6.6.3.8.
Initial hold (min) 2.2. 3.3.
Final hold (min) 20. 5. 9.5
I 1538.1527.1529.1537.1546.
ReferenceChen, Song, et al., 2009Christlbauer and Schieberle, 2009Mallia, Escher, et al., 2009Miyazawa, Tomita, et al., 2009Rochat, Egger, et al., 2009
Comment MSDC-RI MSDC-RI MSDC-RI MSDC-RI MSDC-RI
Column type CapillaryCapillaryCapillaryCapillaryCapillary
Active phase DB-WaxDB-WaxDB-WaxStabilwaxDB-Wax
Column length (m) 30.30.30.30.30.
Carrier gas HeliumHeliumHeliumHeliumHelium
Substrate
Column diameter (mm) 0.250.250.250.250.25
Phase thickness (μm) 0.250.250.250.500.25
Tstart (C) 60.60.60.35.40.
Tend (C) 200.200.200.225.230.
Heat rate (K/min) 8.8.8.6.3.
Initial hold (min) 3.3.3.5.2.
Final hold (min) 9.59.59.510.5.
I 1553.1570.1573.1535.1532.
ReferenceRochat, Egger, et al., 2009Rochat, Egger, et al., 2009Rochat, Egger, et al., 2009Watcharananun, Cadwallader, et al., 2009Zhao, Xu, et al., 2009
Comment MSDC-RI MSDC-RI MSDC-RI MSDC-RI MSDC-RI
Column type CapillaryCapillaryCapillaryCapillaryCapillary
Active phase HP-FFAPHP-20MInnowaxStabilwaxInnowax
Column length (m) 30.50.50.30.60.
Carrier gas HeliumHeHeH2He
Substrate
Column diameter (mm) 0.250.20.20.320.25
Phase thickness (μm) 0.250.20.50.50.25
Tstart (C) 40.70.60.40.60.
Tend (C) 120.180.250.280.240.
Heat rate (K/min) 3.4.2.6.5.
Initial hold (min) 3.4. 5.
Final hold (min) 5.15.60.5.30.
I 1542.1508.1540.1542.1550.
ReferenceGuzman-Geronimo, Lopez, et al., 2008Mastelic, Jerkovic, et al., 2006Bendimerad and Bendiab, 2005Jirovetz, Buchbauer, et al., 2005Joichi, Yomogida, et al., 2005
Comment MSDC-RI MSDC-RI MSDC-RI MSDC-RI MSDC-RI
Column type CapillaryCapillaryCapillaryCapillaryCapillary
Active phase DB-WaxSupelcowax-10Supelcowax-10Supelcowax-10ZB-Wax
Column length (m) 30.60.60.60.30.
Carrier gas HeHeHeHeHelium
Substrate
Column diameter (mm) 0.250.530.530.530.32
Phase thickness (μm) 0.251.1.1.0.25
Tstart (C) 40.40.40.40.40.
Tend (C) 210.240.240.240.250.
Heat rate (K/min) 5.4.4.4.5.
Initial hold (min)  2.2.2.2.
Final hold (min)  20.20.20.5.
I 1537.1572.1572.1573.1509.
ReferenceKumazawa, Kubota, et al., 2005Rochat and Chaintreau, 2005Rochat and Chaintreau, 2005Rochat and Chaintreau, 2005N/A
Comment MSDC-RI MSDC-RI MSDC-RI MSDC-RI MSDC-RI
Column type CapillaryCapillaryCapillaryCapillaryCapillary
Active phase ZB-WaxZB-WaxDB-WaxHP-FFAPDB-Wax
Column length (m) 30.30.30.30.60.
Carrier gas HeliumHeliumH2HeHe
Substrate
Column diameter (mm) 0.320.320.320.250.32
Phase thickness (μm) 0.250.250.50.250.25
Tstart (C) 40.40.40.40.40.
Tend (C) 250.250.200.120.230.
Heat rate (K/min) 5.5.4.5.6.
Initial hold (min) 2.2.5.5.
Final hold (min) 5.5. 3.20.
I 1512.1514.1555.1542.1514.
ReferenceN/AN/ACulleré, Escudero, et al., 2004López, Guzmán, et al., 2004Akiyama, Murakami, et al., 2003
Comment MSDC-RI MSDC-RI MSDC-RI MSDC-RI MSDC-RI
Column type CapillaryCapillaryCapillaryCapillaryCapillary
Active phase DB-WaxTC-WaxSupelcowax-10DB-FFAPDB-FFAP
Column length (m) 60.60.30.30.30.
Carrier gas H2 HeHeHe
Substrate
Column diameter (mm) 0.320.250.250.320.32
Phase thickness (μm) 0.25 0.250.250.25
Tstart (C) 40.80.40.40.40.
Tend (C) 230.240.200.230.230.
Heat rate (K/min) 4.3.3.6.6.
Initial hold (min) 5. 10.2.2.
Final hold (min) 25.  10.10.
I 1533.1500.1525.1516.1516.
ReferenceDregus and Engel, 2003Miyazawa, Yamafuji, et al., 2003Vichi, Castellote, et al., 2003Czerny and Schieberle, 2002Czerny and Schieberle, 2002
Comment MSDC-RI MSDC-RI MSDC-RI MSDC-RI MSDC-RI
Column type CapillaryCapillaryCapillaryCapillaryCapillary
Active phase DB-WaxDB-WaxDB-WaxHP-FFAPDB-Wax
Column length (m) 30.60.30.25.30.
Carrier gas HeHeHe H2
Substrate
Column diameter (mm) 0.250.250.320.320.32
Phase thickness (μm) 0.250.250.50.520.5
Tstart (C) 40.40.40.60.40.
Tend (C) 210.210.240.240.200.
Heat rate (K/min) 5.5.7.5.4.
Initial hold (min)    1.5.
Final hold (min)   5.5.60.
I 1537.1539.1549.1509.1545.
ReferenceKumazawa and Masuda, 2002Kumazawa and Masuda, 2002Lin, Rouseff, et al., 2002Qian and Reineccius, 2002Aznar, López, et al., 2001
Comment MSDC-RI MSDC-RI MSDC-RI MSDC-RI MSDC-RI
Column type CapillaryCapillaryCapillaryCapillaryCapillary
Active phase DB-WaxDB-WaxHP-FFAPFFAPCarbowax 20M
Column length (m) 30.30.50.30.60.
Carrier gas HeH2 HeHe
Substrate
Column diameter (mm) 0.530.320.320.320.32
Phase thickness (μm) 1.0.50.50.250.5
Tstart (C) 40.40.35.40.40.
Tend (C) 225.200.230.230.190.
Heat rate (K/min) 6.4.6.6.2.
Initial hold (min) 5.5. 2.5.
Final hold (min) 30.60.15.5.
I 1510.1545.1533.1525.1556.
ReferenceCadwallader and Heo, 2001Ferreira, Aznar, et al., 2001Preininger and Ullrich, 2001Czerny and Grosch, 2000Escudero, Cacho, et al., 2000
Comment MSDC-RI MSDC-RI MSDC-RI MSDC-RI MSDC-RI
Column type CapillaryCapillaryCapillaryCapillaryCapillary
Active phase DB-WaxInnowaxCarbowaxHP-InnowaxDB-Wax
Column length (m) 60.60.50.25.60.
Carrier gas NitrogenHeN2 He
Substrate
Column diameter (mm) 0.250.250.20.250.32
Phase thickness (μm)  0.25  0.5
Tstart (C) 40.60.80.35.34.
Tend (C) 200.220.200.250.200.
Heat rate (K/min) 2. 1.4.5.
Initial hold (min) 10.10.  3.
Final hold (min)   20. 10.
I 1546.1547.1540.1519.1574.
ReferenceTamura, Boonbumrung, et al., 2000Kaya, Baser, et al., 1999Menon, Chacko, et al., 1999Ong and Acree, 1999Schlüter, Steinhart, et al., 1999
Comment MSDC-RI MSDC-RI MSDC-RI MSDC-RI MSDC-RI
Column type CapillaryCapillaryCapillaryCapillaryCapillary
Active phase DB-WaxDB-WaxDB-WaxCarbowax 20MDB-Wax
Column length (m) 60.30.60.50.60.
Carrier gas HeHelium HeHe
Substrate
Column diameter (mm) 0.320.330.250.250.25
Phase thickness (μm) 0.250.25 0.251.
Tstart (C) 34.40.30.35.50.
Tend (C) 200.200.170.230.200.
Heat rate (K/min) 5.6.2.3.3.
Initial hold (min) 3.5.4.
Final hold (min) 10.30.30.30.40.
I 1524.1531.1532.1542.1532.
ReferenceSchlüter, Steinhart, et al., 1999Suriyaphan, Drake, et al., 1999Buttery and Ling, 1998Chatonnet and Dubourdieu, 1998Horiuchi, Umano, et al., 1998
Comment MSDC-RI MSDC-RI MSDC-RI MSDC-RI MSDC-RI
Column type CapillaryCapillaryCapillaryCapillaryCapillary
Active phase HP-InnowaxHP-InnowaxTC-WaxSupelcowax-10Carbowax 20M
Column length (m) 25.25.60.60.60.
Carrier gas    He
Substrate
Column diameter (mm) 0.320.320.250.250.25
Phase thickness (μm)    0.25
Tstart (C) 35.35.80.40.60.
Tend (C) 250.250.240.200.180.
Heat rate (K/min) 4.4.3.3.2.
Initial hold (min)   5.3.4.
Final hold (min)    30.
I 1519.1519.1540.1536.1509.
ReferenceOng and Acree, 1998Ong, Acree, et al., 1998Shuichi, Masazumi, et al., 1996Wong and Lai, 1996Kawakami, Ganguly, et al., 1995
Comment MSDC-RI MSDC-RI MSDC-RI MSDC-RI MSDC-RI
Column type CapillaryCapillaryCapillaryCapillaryCapillary
Active phase DB-WaxDB-WaxDB-WaxCarbowax 20MCarbowax 20M
Column length (m) 60.60.60.50.50.
Carrier gas HeHe HeHe
Substrate
Column diameter (mm) 0.250.250.250.250.25
Phase thickness (μm)
Tstart (C) 60.60.60.60.60.
Tend (C) 180.180.220.180.180.
Heat rate (K/min) 2.2.3.2.2.
Initial hold (min) 4.4.4.4.4.
Final hold (min)
I 1521.1525.1562.1509.1509.
ReferenceKobayashi, Tsuda, et al., 1995Kobayashi, Tsuda, et al., 1995Chung, Eiserich, et al., 1993Kawakami, Kobayashi, et al., 1993Kawakami and Kobayashi, 1991
Comment MSDC-RI MSDC-RI MSDC-RI MSDC-RI MSDC-RI
Column type CapillaryCapillaryCapillaryPackedCapillary
Active phase DB-WaxDB-WaxCarbowax 20MCarbowaxCarbowax 20M
Column length (m) 60.30.150.3.150.
Carrier gas  Helium He
Substrate    Chromosorb G AW DMCS
Column diameter (mm) 0.320.320.66 0.64
Phase thickness (μm)
Tstart (C) 50.40.60.60.50.
Tend (C) 230.200.170.180.170.
Heat rate (K/min) 4.6.1.4.1.
Initial hold (min)  1.40. 30.
Final hold (min) 10.
I 1532.1539.1500.1530.1530.
ReferenceBinder, Turner, et al., 1990Andersen J.F., Mikolajczak K.L., et al., 1987Buttery and Ling, 1984Schieberle and Grosch, 1983Buttery, Parker, et al., 1981
Comment MSDC-RI MSDC-RI MSDC-RI MSDC-RI MSDC-RI
Column type Capillary
Active phase Carbowax 20M
Column length (m) 150.
Carrier gas
Substrate
Column diameter (mm) 0.64
Phase thickness (μm)
Tstart (C) 50.
Tend (C) 170.
Heat rate (K/min) 1.
Initial hold (min) 30.
Final hold (min)
I 1530.
ReferenceButtery, Ling, et al., 1980
Comment MSDC-RI

References

Aldrich Chemical Company Inc., 1990
Aldrich Chemical Company Inc.,
Catalog Handbook of Fine Chemicals, Aldrich Chemical Company, Inc., Milwaukee WI, 1990, 1. [all data]
Stephenson and Malanowski, 1987
Stephenson, Richard M.; Malanowski, Stanislaw,
Handbook of the Thermodynamics of Organic Compounds, 1987, https://doi.org/10.1007/978-94-009-3173-2
. [all data]