2-Heptenal, (E)-
- Formula: C7H12O
- Molecular weight: 112.1696
- IUPAC Standard InChIKey: NDFKTBCGKNOHPJ-AATRIKPKSA-N
- CAS Registry Number: 18829-55-5
- Chemical structure:
View 3d structure (requires JavaScript / HTML 5) - Stereoisomers:
- Other names: (E)-2-Hepten-1-al; (E)-2-Heptenal; n-Hept-trans-2-enal; trans-2-Heptenal; Hept-trans-2-enal; 2-trans-Heptenal; trans-2-Hepten-1-al; β-Butylacrolein; 3-Butylacrolein; (2E)-2-Heptenal; (2E)-Heptenal; (E)-hept-2-enal; Hept-2(E)-enal; Hept-(E)-2-enal; 2-Heptenal, (2E)-

Phase change data

Data compiled by: Robert L. Brown and Stephen E. Stein
Reduced pressure boiling point
Tboil (K) | Pressure (bar) | Reference |
---|---|---|
363.7 | 0.067 | Aldrich Chemical Company Inc., 1990 |

Normal alkane RI, polar column, custom temperature program

Data compiled by: NIST Mass Spectrometry Data Center, William E. Wallace, director

Column type CapillaryCapillaryCapillaryCapillaryCapillary
Active phase Supelco CO Wax-10Supelco CO Wax-10DB-WaxCP-Wax 52 CBSupelcowax-10
Column length (m) 60.60.60.60.30.
Carrier gas HeliumHeliumHeliumHeliumHe
Substrate
Column diameter (mm) 0.320.320.250.250.25
Phase thickness (μm) 0.250.250.500.250.25
Program 35 0C (6 min) 2 0C/min -> 60 0C (5 min) 5 0C/min -> 200 0C 25 0C/min -> 250 0C (6 min)not specified40 0C 4 0C/min -> 230 0C 100 0C/min -> 260 0C (11.7 min)45 0C (5 min) 3 0C/min -> 150 0C 10 0C/min -> 240 0C40C(3min) => 4C/min => 75C => 8C/min => 250C(5min)
I 1334.1334.1315.1329.1334.
ReferencePrompona, Kandylis, et al., 2012Prompona, Kandylis, et al., 2012Miyazaki, Plotto, et al., 2011Romeo, Verzera, et al., 2009Vichi, Guadayol, et al., 2007
Comment MSDC-RI MSDC-RI MSDC-RI MSDC-RI MSDC-RI
Column type CapillaryCapillaryCapillaryCapillaryCapillary
Active phase Innowax FSCHP-Innowax FSCHP Innowax FSPHP-Innowax FSCHP-Innowax FSC
Column length (m) 60.60.60.60.60.
Carrier gas He N2HeN2
Substrate
Column diameter (mm) 0.250.250.250.250.25
Phase thickness (μm) 0.250.250.250.250.25
Program 60C(10min) => 4C/min >220C (10min) => 1C/min => 240C60C(10min) => 4C/min => 220C (10min) => 1C/min => 240C60C(10min) => 4C/min => 220C(10min) => 1C/min => 240C60C (10min) => 4C/min => 220C (10min) => 1C/min => 240C60C(10min) => 4C/min => 220C(10min) => 1C/min => 240C
I 1339.1335.1335.1335.1335.
ReferenceBaser, Özek, et al., 2006Tabanca, Demirci, et al., 2006Altintas, Kose, et al., 2004Demirci, Baser, et al., 2003Kaya, Demirci, et al., 2003
Comment MSDC-RI MSDC-RI MSDC-RI MSDC-RI MSDC-RI
Column type CapillaryCapillaryCapillaryCapillaryCapillary
Active phase HP Innowax FSPInnowaxInnowaxCP-Wax 52CBFFAP
Column length (m) 60.60.60.50.30.
Carrier gas HeHeHeHeHe
Substrate
Column diameter (mm) 0.250.250.250.250.32
Phase thickness (μm) 0.250.250.250.20.25
Program 60C(10min) => 4C/min => 220C (10min) => 1C/min => 240C60 0C (10 min) 4 K/min -> 220 0C (10 min) 1 K/min -> 240 0C60 0C (10 min) 4 K/min -> 220 0C (10 min) 1 K/min -> 240 0C30C (1.5min) => 3C/min => 120C => 10C/min => 220C (3.5min)35C(1min) => 40C/min => 60C (1min) => 6C/min => 230C
I 1335.1335.1335.1320.1287.
ReferenceTasdemir, Demirci, et al., 2003Baser, Özek, et al., 2000Baser, Özek, et al., 2000, 2Jakobsen, Hansen, et al., 1998Matsui, Guth, et al., 1998
Comment MSDC-RI MSDC-RI MSDC-RI MSDC-RI MSDC-RI
Column type CapillaryCapillaryCapillaryCapillaryCapillary
Active phase Supelcowax 10Supelcowax 10Supelcowax 10CP-Wax 52CBCP Wax 52 CB
Column length (m) 60.60.60. 50.
Carrier gas HeliumHeliumHelium
Substrate
Column diameter (mm) 0.250.250.25 0.32
Phase thickness (μm) 0.250.250.25 0.20
Program 60 0C (10 min) 2 0C/min -> 80 0C 3 0C/min -> 100 0C 4 0C/min -> 220 0C (30 min)not specifiednot specified40C => 2C/min => 150C => 10C/min => 250C50 0C (10 min) 2 0C/min -> 100 0C 5 0C/min -> 150 0C 7 0C/min -> 220 0C (20 min)
I 1316.1315.1328.1312.1310.
ReferenceCastioni and Kapetanidis, 1996Castioni and Kapetanidis, 1996Castioni and Kapetanidis, 1996Luning, Carey, et al., 1995Patterson and Stevenson, 1995
Comment MSDC-RI MSDC-RI MSDC-RI MSDC-RI MSDC-RI
Column type CapillaryCapillary
Active phase FFAPDB-Wax
Column length (m)  60.
Carrier gas
Substrate
Column diameter (mm)  0.32
Phase thickness (μm)
Program not specifiednot specified
I 1335.1320.
ReferenceBlank, Stampfli, et al., 1994Binder and Flath, 1989
Comment MSDC-RI MSDC-RI

Normal alkane RI, non-polar column, custom temperature program

Data compiled by: NIST Mass Spectrometry Data Center, William E. Wallace, director

Column type CapillaryCapillaryCapillaryCapillaryCapillary
Active phase DB-5SLB-5 MSSLB-5 MSHP-5DB-5 MS
Column length (m) 60.30.30.50.30.
Carrier gas HeliumHeliumHeliumHeliumHelium
Substrate
Column diameter (mm) 0.250.250.250.320.32
Phase thickness (μm) 1.000.250.251.051.0
Program 40 0C 4 0C/min -> 230 0C 100 0C/min -> 260 0C (11.7 min)50 0C 3 0C/min -> 250 0C (1 min) 10 0C/min -> 300 0C (5 min)not specified40 0C (10 min) 5 0C/min -> 200 0C 15 0C/min -> 250 0C (10 min)-10 0C (3 min) 50 0C/min -> 40 0C 5 0C/min -> 290 0C (5 min)
I 970.956.947.957.961.
ReferenceMiyazaki, Plotto, et al., 2011Costa, De Fina, et al., 2008Costa, De Fina, et al., 2008Ventanas, Estevez, et al., 2008Watanabe, Ueda, et al., 2008
Comment MSDC-RI MSDC-RI MSDC-RI MSDC-RI MSDC-RI
Column type CapillaryCapillaryCapillaryCapillaryCapillary
Active phase HP-5 MSHP-5 MSHP-1HP-5HP-5 MS
Column length (m) 30.30.50.50.30.
Carrier gas HeliumHeliumHe Helium
Substrate
Column diameter (mm) 0.250.250.20.320.25
Phase thickness (μm) 0.250.250.331.050.25
Program 40 0C (2 min) 4 0C/min -> 220 0C 20 0C/min -> 280 0C40 0C (2 min) 4 0C/min -> 220 0C 20 0C/min -> 280 0C40C(2min) => 2C/min => 200C => 15C/min => 250C (30min)35 0C (10 min) 10 0C/min -> 150 0C 20 0C/min -> 250 0C (10 min)40 0C (10 min) 3 0C/min -> 200 0C 2 0C/min -> 220 0C
I 957.958.934.940.967.
ReferenceXie, Sun, et al., 2008Xie, Sun, et al., 2008Barra, Baldovini, et al., 2007Carrapiso and Garsia, 2007Moriarity, Bansal, et al., 2007
Comment MSDC-RI MSDC-RI MSDC-RI MSDC-RI MSDC-RI
Column type CapillaryCapillaryCapillaryCapillaryCapillary
Active phase 5 % Phenyl methyl siloxaneHP-5HP-5DB-5DB-1
Column length (m) 30.30.50.30.60.
Carrier gas  Helium He
Substrate
Column diameter (mm) 0.250.320.320.320.32
Phase thickness (μm) 0.750.251.050.25
Program 50C(1min) => 5C/min => 100C => 10C/min => 190C => 30C/min => 250C(1min)not specified40C(10min) => 5C/min => 200C => 20C/min => 250C(5min)35C(1min) => 40C/min => 60C (1min) => 6C/min => 230Cnot specified
I 958.961.960.946.927.
ReferenceBeaulieu J.C. and Lea J.M., 2006Kucuk, Gulec, et al., 2006Garcia-Estaban, Ansorena, et al., 2004Matsui, Guth, et al., 1998Binder and Flath, 1989
Comment MSDC-RI MSDC-RI MSDC-RI MSDC-RI MSDC-RI

Kovats' RI, non-polar column, temperature ramp

Data compiled by: NIST Mass Spectrometry Data Center, William E. Wallace, director

Column type CapillaryCapillaryCapillaryCapillaryCapillary
Active phase DB-1DB-1SE-54SE-30SE-30
Column length (m) 60.60.30.50.50.
Carrier gas   HeHeHe
Substrate
Column diameter (mm) 0.250.250.250.50.5
Phase thickness (μm) 0.250.250.25
Tstart (C) 30.30.0.40.40.
Tend (C) 220.220.250.170.170.
Heat rate (K/min) 2.2.12.3.3.
Initial hold (min) 4.4.12.3.3.
Final hold (min)
I 927.929.952.941.941.
ReferenceTakeoka, Perrino, et al., 1996Takeoka, Perrino, et al., 1996Rembold, Wallner, et al., 1989Greenberg, 1981Greenberg, 1981
Comment MSDC-RI MSDC-RI MSDC-RI MSDC-RI MSDC-RI

References

Aldrich Chemical Company Inc., 1990
Aldrich Chemical Company Inc.,
Catalog Handbook of Fine Chemicals, Aldrich Chemical Company, Inc., Milwaukee WI, 1990, 1. [all data]