2-tBu-p-benzoquinone radical

Gas phase ion energetics data

Data compiled by: John E. Bartmess

Electron affinity determinations

EA (eV) Method Reference Comment
1.804 ± 0.048IMREFukuda and McIver, 1985

References

Fukuda and McIver, 1985
Fukuda, E.K.; McIver, R.T., Jr., Relative electron affinities of substituted benzophenones, nitrobenzenes, and quinones. [Anchored to EA(SO2) from 74CEL/BEN], J. Am. Chem. Soc., 1985, 107, 2291. [all data]