6-tert-Butyl-2,4-dimethylphenol
- Formula: C12H18O
- Molecular weight: 178.2707
- IUPAC Standard InChIKey: OPLCSTZDXXUYDU-UHFFFAOYSA-N
- CAS Registry Number: 1879-09-0
- Chemical structure:
View 3d structure (requires JavaScript / HTML 5) - Other names: 2,4-Dimethyl-6-tert-butylphenol; Phenol, 2-(1,1-dimethylethyl)-4,6-dimethyl-; Topanol A; 2-tert-Butyl-4,6-dimethylphenol; 2,4-Xylenol, 6-tert-butyl-; 6-tert-Butyl-2,4-xylenol; 6-t-Butyl-2,4-dimethylphenol; 6-t-Butyl-2,4-xylenol; Prodox 340; 2-Methyl-6-tert-butyl-p-cresol; NSC 8130

Phase change data

Data compiled as indicated in comments:
AC - William E. Acree, Jr., James S. Chickos
Quantity | Value | Units | Method | Reference | Comment |
---|---|---|---|---|---|
ΔvapH° | 68.4 ± 0.8 | kJ/mol | N/A | Verevkin, 1999 | AC |
Enthalpy of vaporization
ΔvapH (kJ/mol) | Temperature (K) | Method | Reference | Comment |
---|---|---|---|---|
67.2 ± 0.8 | 318. | GS | Verevkin, 1999 | Based on data from 304. to 333. K.; AC |
58.4 | 403. | A | Stephenson and Malanowski, 1987 | Based on data from 388. to 522. K.; AC |
54.4 | 348. | N/A | Stage, Müller, et al., 1953 | Based on data from 344. to 535. K.; AC |
52.7 | 373. | N/A | Stage, Müller, et al., 1953 | Based on data from 344. to 535. K.; AC |
51.7 | 398. | N/A | Stage, Müller, et al., 1953 | Based on data from 344. to 535. K.; AC |
49.7 | 423. | N/A | Stage, Müller, et al., 1953 | Based on data from 344. to 535. K.; AC |
45.4 | 473. | N/A | Stage, Müller, et al., 1953 | Based on data from 344. to 535. K.; AC |
Antoine Equation Parameters
log10(P) = A − (B / (T + C))
P = vapor pressure (bar)
T = temperature (K)
View plot Requires a JavaScript / HTML 5 canvas capable browser.
Temperature (K) | A | B | C | Reference | Comment |
---|---|---|---|---|---|
343.5 to 509.7 | 6.69118 | 3691.789 | 42.615 | Stull, 1947 | Coefficents calculated by NIST from author's data. |

Van Den Dool and Kratz RI, non-polar column, temperature ramp

Column type | Active phase | I | Reference | Comment |
---|---|---|---|---|
Capillary | OV-1 | 1363.9 | Gautzsch and Zinn, 1996 | 8. K/min; Tstart: 35. C; Tend: 300. C |

References

Verevkin, 1999
Verevkin, Sergey P.,
Thermochemistry of phenols: buttress effects in sterically hindered phenols,
The Journal of Chemical Thermodynamics, 1999, 31, 11, 1397-1416, https://doi.org/10.1006/jcht.1999.0466
. [all data]
Stephenson and Malanowski, 1987
Stephenson, Richard M.; Malanowski, Stanislaw,
Handbook of the Thermodynamics of Organic Compounds, 1987, https://doi.org/10.1007/978-94-009-3173-2
. [all data]
Stage, Müller, et al., 1953
Stage, H.; Müller, E.; Faldix, P.,
Erdol u Kohle, 1953, 6, 375. [all data]
Stull, 1947
Stull, Daniel R.,
Vapor Pressure of Pure Substances. Organic and Inorganic Compounds,
Ind. Eng. Chem., 1947, 39, 4, 517-540, https://doi.org/10.1021/ie50448a022
. [all data]
Gautzsch and Zinn, 1996
Gautzsch, R.; Zinn, P.,
Use of incremental models to estimate the retention indexes of aromatic compounds,
Chromatographia, 1996, 43, 3/4, 163-176, https://doi.org/10.1007/BF02292946
. [all data]