Cyclohexane, 1-methyl-4-(1-methylethenyl)-, cis-
- Formula: C10H18
- Molecular weight: 138.2499
- IUPAC Standard InChIKey: WPMKLOWQWIDOJN-AOOOYVTPSA-N
- CAS Registry Number: 1879-07-8
- Chemical structure:
View 3d structure (requires JavaScript / HTML 5) - Stereoisomers:
- Other names: p-Menth-8-ene, cis-; cis-p-Menth-8-ene; cis-1-Isopropenyl-4-methylcyclohexane; 8-p-Menthene (cis); 1-Isopropenyl-4-methylcyclohexane, (Z)-

Phase change data

Data compiled by: Thermodynamics Research Center, NIST Boulder Laboratories, Chris Muzny director
Quantity | Value | Units | Method | Reference | Comment |
---|---|---|---|---|---|
Tboil | 441.7 | K | N/A | Skita and Schneck, 1922 | Uncertainty assigned by TRC = 2. K |

References

Skita and Schneck, 1922
Skita, A.; Schneck, A.,
Stereoismerism in Cyclic Hydrocarbons,
Chem. Ber., 1922, 55, 144-52. [all data]