Benzeneacetic acid, 3-nitro-
- Formula: C8H7NO4
- Molecular weight: 181.1455
- IUPAC Standard InChIKey: WUKHOVCMWXMOOA-UHFFFAOYSA-N
- CAS Registry Number: 1877-73-2
- Chemical structure:
View 3d structure (requires JavaScript / HTML 5) - Other names: 3-Nitrophenylacetic acid; m-Nitrophenyl acetic acid; Acetic acid, (m-nitrophenyl)-; 3-Nitrobenzeneacetic acid

Phase change data

Data compiled by: Thermodynamics Research Center, NIST Boulder Laboratories, Chris Muzny director
Quantity | Value | Units | Method | Reference | Comment |
---|---|---|---|---|---|
Tfus | 390.65 | K | N/A | Beringer, Brierley, et al., 1953 | Uncertainty assigned by TRC = 2. K |

References

Beringer, Brierley, et al., 1953
Beringer, F.M.; Brierley, A.; Drexler, M.; Gindler, E.M.; Lumpkin, C.C.,
Diaryliodonium Salts II. The Phenylation of Organic and Inorganic Bases,
J. Am. Chem. Soc., 1953, 75, 2708. [all data]