Benzoic acid, 3-cyano-
- Formula: C8H5NO2
- Molecular weight: 147.1308
- IUPAC Standard InChIKey: GYLKKXHEIIFTJH-UHFFFAOYSA-N
- CAS Registry Number: 1877-72-1
- Chemical structure:
View 3d structure (requires JavaScript / HTML 5) - Other names: Benzoic acid, m-cyano-; m-Carboxybenzonitrile; m-Cyanobenzoic acid; 3-Cyanobenzoic acid

Phase change data

Data compiled by: William E. Acree, Jr., James S. Chickos
Quantity | Value | Units | Method | Reference | Comment |
---|---|---|---|---|---|
ΔsubH° | 116.6 ± 0.9 | kJ/mol | C | Ribeiro da Silva, Amaral, et al., 2008 |

Reaction thermochemistry data

Data compiled by: John E. Bartmess
Individual Reactions
C8H4NO2- + =
By formula: C8H4NO2- + H+ = C8H5NO2
Quantity | Value | Units | Method | Reference | Comment |
---|---|---|---|---|---|
ΔrH° | 1374. ± 8.8 | kJ/mol | G+TS | Kebarle and McMahon, 1977 | gas phase |
Quantity | Value | Units | Method | Reference | Comment |
ΔrG° | 1345. ± 8.4 | kJ/mol | IMRE | Kebarle and McMahon, 1977 | gas phase |

Gas phase ion energetics data

Data compiled by: John E. Bartmess
De-protonation reactions
C8H4NO2- + =
By formula: C8H4NO2- + H+ = C8H5NO2
Quantity | Value | Units | Method | Reference | Comment |
---|---|---|---|---|---|
ΔrH° | 1374. ± 8.8 | kJ/mol | G+TS | Kebarle and McMahon, 1977 | gas phase |
Quantity | Value | Units | Method | Reference | Comment |
ΔrG° | 1345. ± 8.4 | kJ/mol | IMRE | Kebarle and McMahon, 1977 | gas phase |

References

Ribeiro da Silva, Amaral, et al., 2008
Ribeiro da Silva, Manuel A.V.; Amaral, Luísa M.P.F.; Boaventura, Cristina R.P.; Gomes, José R.B.,
Standard molar enthalpies of formation of 2-, 3- and 4-cyanobenzoic acids,
The Journal of Chemical Thermodynamics, 2008, 40, 8, 1226-1231, https://doi.org/10.1016/j.jct.2008.04.004
. [all data]
Kebarle and McMahon, 1977
Kebarle, P.; McMahon, T.B.,
Intrinsic Acidities of Substituted Phenols and Benzoic Acids Determined by Gas Phase Proton Transfer Equilibria,
J. Am. Chem. Soc., 1977, 99, 7, 2222, https://doi.org/10.1021/ja00449a032
. [all data]