5-nitrofuran-2-acrylaldehyde

Condensed phase thermochemistry data

Data compiled by: Hussein Y. Afeefy, Joel F. Liebman, and Stephen E. Stein

Quantity Value Units Method Reference Comment
Δfsolid-163. ± 1.kJ/molCcbBalepin, Lebedev, et al., 1980see Balepin, Lebedev, et al., 1978
Quantity Value Units Method Reference Comment
Δcsolid-3307. ± 1.kJ/molCcbBalepin, Lebedev, et al., 1980see Balepin, Lebedev, et al., 1978

References

Balepin, Lebedev, et al., 1980
Balepin, A.A.; Lebedev, V.P.; Kuznetsova, A.A.; Venter, K.K.; Trushule, M.A.; Lolya, D.O.; Lebedev, Yu.A., Thermochemical properties of α-nitro derivatives of furan, Bull. Acad. Sci. USSR, Div. Chem. Sci., 1980, 601-604. [all data]

Balepin, Lebedev, et al., 1978
Balepin, A.A.; Lebedev, V.P.; Kuznetsova, A.A.; Venters, K.; Trusule, M.; Ignatovich, L.M.; Lebedev, Yu.A., Aromatic stabilizatio of furan derivatives, Vses. Nauchn. Konf. Khim. Tekhnol. Furanovykh Soedin., [Tezisy Dokl.], 1978, 3, 57-58. [all data]